{"text_format":"1","workbook":"xlsx","n_sheets":7,"sheets":["MIPI TX","MIPI RX","DYNAMIC HRES GEN","step","Data Type","W Dummy","Revision History"],"not_rendered":{"charts":0,"images":3,"macros":1,"external_links":0,"defined_names":7,"comments":1,"pivot_tables":0},"unopened":[],"bounds":{"document_bytes":16777216,"sheet_cells":100000,"rows_first":2000,"rows_last":500,"rows_between":2000,"halvings":0,"cell_chars":16384,"cell_head_chars":4096},"cells_cut":0,"cells_raw":0,"read":"whole","date_system":"1900"}

{"sheet":"MIPI TX","index":0,"n_rows":564,"n_cols":9,"rows_kept":564,"cut":false,"hidden":false,"merged":[[5,12,6,21],[0,0,0,1],[0,2,0,3],[0,4,0,5],[2,10,3,11],[3,12,4,21],[2,12,2,21],[1,12,1,21]]}
[null,null,"MIPI Transmitter Utility"]
[null,"Enter the video information",null,null,null,"Input fields"]
[null,"Data type","RAW10"]
[null,"# of data pixels per line",1920]
[null,"# of data lines per frame",1080]
[null,"# of blanking lines per frame",3,null,{"$f":"C6*C42","v":24.599999999999998}]
[null,"# of frames per second (Hz)",60]
[null,"Horizontal blanking per line (us)",5,{"$f":"IF(OR(C3='Data Type'!B15,C3='Data Type'!B16),\"Enter the value of the even lines. You should apply the same line rate to odd and even lines.\",\"\")","v":""}]
[null,"Pixel clock frequency (MHz)",100]
[]
[null,"Enter the MIPI interface details"]
[null,"Data rate (Mbps)",1500]
[null,"# of lanes",4]
[null,"Frame Mode","General",null,null,null,null,null,"Hidden to customers; always General"]
[null,"Clock mode","Continuous"]
[]
[null,"Enter the TX timing parameter settings"]
[null,"TxClkEsc Frequency (MHz)",20,null,null,null,null,null,"Hidden to customers; always 20"]
[null,"THS-PREPARE (ns)",66]
[null,"THS-ZERO (ns)",150]
[null,"THS-TRAIL (ns)",970]
[null,"TCLK-POST (ns)",249]
[null,"TCLK-TRAIL (ns)",64]
[null,"TCLK-PREPARE (ns)",56]
[null,"TCLK-ZERO (ns)",320]
[null,"TCLK-PRE (ns)",300]
[]
[null,"Use default values",true,null,null,null,null,null,"Hidden to customers"]
[null,null,null,null,null,null,null,null,"Hidden to customers"]
[null,"Pixel data (based on the data type)",null,null,null,null,null,null,"Hidden to customers"]
[null,"YUV 420?",{"$f":"OR(C3='Data Type'!B15,C3='Data Type'!B16)","v":false},null,null,null,null,null,"Hidden to customers"]
[null,"YUV?",{"$f":"OR(C3='Data Type'!B15,C3='Data Type'!B16,C3='Data Type'!B17,C3='Data Type'!B18,C3='Data Type'!B19)","v":false},null,null,null,null,null,"Hidden to customers"]
[null,"Maximum # of pixels per line",{"$f":"VLOOKUP($C$3,'Data Type'!B3:I19,8)","v":4608},null,null,null,null,null,"Hidden to customers"]
[null,{"$f":"IF(C31,\"# of pixels per pixel clock (even lines)\",\"# of pixels per pixel clock\")","v":"# of pixels per pixel clock"},{"$f":"VLOOKUP($C$3,'Data Type'!B3:F19,4)","v":6},{"$f":"IF(C32,\"(on average)\",\"\")","v":""},null,null,null,null,"Hidden to customers"]
[null,{"$f":"IF(C31,\"# of bits per pixel (even lines)\",\"# of bits per pixel\")","v":"# of bits per pixel"},{"$f":"VLOOKUP($C$3,'Data Type'!B3:F19,2)","v":10},{"$f":"IF(C32,\"(on average)\",\"\")","v":""},null,null,null,null,"Hidden to customers"]
[null,{"$f":"IF(C31,\"# of pixels per pixel clock (odd lines)\",\"\")","v":""},{"$f":"VLOOKUP($C$3,'Data Type'!B3:F19,5)","v":""},null,null,null,null,null,"Hidden to customers"]
[null,{"$f":"IF(C31,\"# of bits per pixel (odd lines)\",\"\")","v":""},{"$f":"VLOOKUP($C$3,'Data Type'!B3:F19,3)","v":""},null,null,null,null,null,"Hidden to customers"]
[null,"# of bits per line",{"$f":"C4*C35","v":19200},{"$f":"IF(C31,\"(even lines)\",\"\")","v":""},null,null,null,null,"Hidden to customers"]
[null,"BW overhead spec",0.1,null,null,null,null,null,"Hidden to customers"]
[null,"Minimum Line Rate (kHz)",{"$f":"(C5+C6)*C7/1000","v":64.98},null,null,null,null,null,"Hidden to customers"]
{"$rows_left_out":525}
{"sheet":"MIPI RX","index":1,"n_rows":35,"n_cols":9,"rows_kept":35,"cut":false,"hidden":false,"merged":[[0,0,0,1],[0,2,0,3],[0,4,0,5]]}
[null,null,"MIPI Receiver Utility"]
[null,"Enter the video information",null,null,null,"Input fields"]
[null,"Data type","RAW10"]
[null,"# of data pixels per line",1920]
[null,"Pixel clock frequency (MHz)",60]
[]
[null,"Enter the MIPI interface details"]
[null,"Data rate (Mbps)",1500]
[null,"# of data lanes",4]
[null,"Clock mode","Continuous"]
[null,"Line rate (kHz)",100,{"$f":"IF(OR(C3='Data Type'!B15,C3='Data Type'!B16),\"Enter line-rate of even lines\",\"\")","v":""}]
[null,"Camera's THS-TRAIL delay (ns)",70]
[null,"Camera's TCLK-POST delay (ns)",300,"For Non-continuous Clock Mode only"]
[null,"Camera's THS-EXIT delay (ns)",100]
[]
[null,"YUV 420?",{"$f":"OR(C3='Data Type'!B15,C3='Data Type'!B16)","v":false},null,null,null,null,null,"Hidden to customers"]
[null,"YUV?",{"$f":"OR(C3='Data Type'!B15,C3='Data Type'!B16,C3='Data Type'!B17,C3='Data Type'!B18,C3='Data Type'!B19)","v":false},null,null,null,null,null,"Hidden to customers"]
[null,"Maximum # of pixels per line",{"$f":"VLOOKUP($C$3,'Data Type'!B3:I19,8)","v":4608},null,null,null,null,null,"Hidden to customers"]
[null,{"$f":"IF(C16,\"# of pixels per pixel clock (even lines)\",\"# of pixels per pixel clock\")","v":"# of pixels per pixel clock"},{"$f":"VLOOKUP($C$3,'Data Type'!B3:H19,7)","v":4},{"$f":"IF(C17,\"(on average)\",\"\")","v":""},null,null,null,null,"Hidden to customers"]
[]
[null,"THS-TRAIL (ns)",{"$f":"IF(C9=1,48/C8*1000,IF(C9=2,72/C8*1000,80/C8*1000))","v":53.333333333333336},null,null,null,null,null,"Hidden to customers"]
[null,"Minimum THS-TRAIL (ns)",{"$f":"MAX(C21,65)","v":65}]
[null,"Minimum THS-TRAIL+TCLK-POST (ns)",{"$f":"IF(C10=\"Continuous\",\"n/a\",IF(C9=1,750/C8*1000,IF(C9=2,450/C8*1000,260/C8*1000)))","v":"n/a"}]
[null,"Minimum THS-EXIT (ns)",{"$f":"MAX(72/C8*1000,100)","v":100}]
[]
[null,"Minimum RX pixel clock frequency (MHz)",{"$f":"120%*C4*C11/C19/1000","v":57.6}]
[]
[null,"Results"]
[null,"Maximum line buffer test",{"$f":"IF(C4>C18,\"Action Required\",\"PASS\")","v":"PASS"},{"$f":"IF(C29<>\"PASS\",\"Try tuning the camera's register settings to a) decreasing the number of pixels per line, or b) selecting a different data type.\",\"\")","v":""}]
[null,"Minimum RX pixel clock frequency test",{"$f":"IF(C26>C5,\"Action Required\",\"PASS\")","v":"PASS"},{"$f":"IF(C30<>\"PASS\",\"Try a) increasing the pixel clock frequency, or tuning the camera's register settings to b) decreasing the number of pixels per line, or c) decreasing the line rate.\",\"\")","v":""}]
[null,"Minimum THS-EXIT test",{"$f":"IF(C24>C14,\"Action Required\",\"PASS\")","v":"PASS"},{"$f":"IF(C31<>\"PASS\",\"Try tuning the camera's register settings to a) increase THS-EXIT delay, or b) increase the data rate.\",\"\")","v":""}]
[null,"Minimum THS-TRAIL test",{"$f":"IF(C22>C12,\"Action Required\",\"PASS\")","v":"PASS"},{"$f":"IF(C32<>\"PASS\",\"Try tuning the camera's register settings to a) increase THS-TRAIL delay, or b) increase the data rate.\",\"\")","v":""}]
[null,"Minimum THS-TRAIL+TCLK-POST test",{"$f":"IF(C10=\"Non-continuous\",IF(C23>C12+C13,\"Action Required\",\"PASS\"),\"n/a\")","v":"n/a"},{"$f":"IF(C33=\"Action Required\",\"Try tuning the camera's register settings to a) increase THS-TRAIL delay, or a) increase TCLK-POST delay, or c) increase the data rate, or d) increase the number of data lanes, or e) use Continuous Clock Mode.\",\"\")","v":""}]
[]
["© Efinix, Inc."]

{"sheet":"DYNAMIC HRES GEN","index":2,"n_rows":14,"n_cols":20,"rows_kept":14,"cut":false,"hidden":false,"merged":[[5,19,6,20],[11,15,11,24],[12,15,12,24],[13,15,14,24]]}
[null,null,{"$f":"'MIPI TX'!C41","v":56.971219512195134},null,{"$f":"MAX(I3,H3)-F1","v":5},{"$f":"'MIPI TX'!C4/'MIPI TX'!C9/'MIPI TX'!C34","v":3.1999999999999997},"PHY DELAY",{"$f":"'MIPI TX'!C52+'MIPI TX'!C54+100","v":1586}]
[1500,"HRES","Active L","Blank L","FPS(Hz)","P CLK(MHz)","V Blank(us)","Max. H Total(us)","W Dummy HS\nMin. H Total(us)","HBP","HFP","HS Pulse","HBP","HFP","HS Pulse"]
[{"$f":"'MIPI TX'!C3","v":"RAW10"},{"$f":"'MIPI TX'!C4","v":1920},{"$f":"'MIPI TX'!C5","v":1080},{"$f":"'MIPI TX'!C6","v":3},{"$f":"'MIPI TX'!C7","v":60},{"$f":"'MIPI TX'!C9","v":100},{"$f":"'MIPI TX'!E6","v":24.599999999999998},{"$f":"'MIPI TX'!C42","v":8.1999999999999993},{"$f":"('MIPI TX'!E42)/1000","v":5.4867999999999997},{"$f":"'W Dummy'!M49","v":231},{"$f":"'W Dummy'!N49","v":116},{"$f":"'W Dummy'!O49","v":39},{"$f":"'W Dummy'!M23","v":165},{"$f":"'W Dummy'!N23","v":83},{"$f":"'W Dummy'!O23","v":28}]
[]
[{"$f":"A2/1000 & \"GHz\"","v":"1.5GHz"},"HRES","Max. Active Line","Blank Line","FPS(Hz)","P CLK(MHz)","V Blank(us)","Max. H Total(us)","Min. H Total(us)","Min. HBP","Min. HFP","Min. HS Pulse","HBP","HFP","HS Pulse"]
["RAW10",32,1516,3,600,100,3.2889999999999997,1.0963333333333332,1.0551199999999998,61,31,11,60,30,10,null,null,null,null,{"$f":"IF(('MIPI TX'!C70=\"PASS\")*AND('MIPI TX'!C71=\"PASS\")*AND('MIPI TX'!C72=\"PASS\")*AND('MIPI TX'!C73=\"PASS\"),\"READY TO GEN\",\"NOT READY\")","v":"READY TO GEN"}]
["RAW10",64,1426,3,600,100,3.4969999999999999,1.1656666666666666,1.11144,63,32,11,60,30,10]
["RAW10",1664,420,3,600,100,11.797000000000001,3.9323333333333332,3.9274400000000003,151,76,26,96,48,16]
["RAW10",1920,376,3,600,100,13.160999999999998,4.3869999999999996,4.3780000000000001,165,83,28,102,51,17]
[]
[null,null,null,null,null,null,null,null,null,null,null,null,null,null,null,"Tips:"]
[null,null,null,null,null,null,null,null,null,null,null,null,null,null,null,"1. Input Tx information for one of the resolutions you want to use into the MIPI TX worksheet until it passes. This sheet should display \"READY TO GEN” when it passes."]
[null,null,null,null,null,null,null,null,null,null,null,null,null,null,null,"2. Use this sheet, DYNAMIC HRES GEN, to enter all the resolutions you want to use in the HRES column."]
[null,null,null,null,null,null,null,null,null,null,null,null,null,null,null,"3. Click the “Generate Porch and Max. # of Lines” button. The utility generates the required maximum and minimum porch values for each resolution."]

{"sheet":"step","index":3,"n_rows":369,"n_cols":6,"rows_kept":369,"cut":false,"hidden":true,"merged":[]}
[null,null,"Period of tx__m_txclkesc (ns)",50]
[]
[]
["OUTCLKSEL","Bit Rate (Mbps)","OSC_CAL_CLK (MHz)","UI (ns)",null,"Step (ns)"]
[0,{"$f":"IF(A5<64,(80*1*1000)+(5*1000/4)*(A5-0),(IF(A5<128,(80*2*1000)+(5*1000/2)*(A5-64),(80*4*1000)+(5*1000/1)*(A5-128))))/1000","v":80},{"$f":"IF(A5<37,B5*4/4,(IF(A5<64,B5*4/6,IF(A5<101,B5*2/4,IF(A5<128,B5*2/6,IF(A5<165,B5*1/4,IF(A5<215,B5*1/6,IF(A5<215,B5*1/6,IF(A5<265,B5*1/8,IF(A5<315,B5*1/10,B5*1/12))))))))))","v":80},{"$f":"1000/B5","v":12.5},{"$f":"B5/C5","v":1},{"$f":"1/C5*1000","v":12.5}]
[1,{"$f":"IF(A6<64,(80*1*1000)+(5*1000/4)*(A6-0),(IF(A6<128,(80*2*1000)+(5*1000/2)*(A6-64),(80*4*1000)+(5*1000/1)*(A6-128))))/1000","v":81.25},81.25,{"$f":"1000/B6","v":12.307692307692308},{"$f":"B6/C6","v":1},12.307692307692308]
[2,82.5,82.5,12.121212121212121,1,12.121212121212121]
[3,83.75,83.75,11.940298507462687,1,11.940298507462687]
[4,85,85,11.764705882352942,1,11.76470588235294]
[5,86.25,86.25,11.594202898550725,1,11.594202898550725]
[6,87.5,87.5,11.428571428571429,1,11.428571428571429]
[7,88.75,88.75,11.267605633802816,1,11.267605633802818]
[8,90,90,11.111111111111111,1,11.111111111111111]
[9,91.25,91.25,10.95890410958904,1,10.95890410958904]
[10,92.5,92.5,10.810810810810811,1,10.810810810810811]
[11,93.75,93.75,10.666666666666666,1,10.666666666666666]
[12,95,95,10.526315789473685,1,10.526315789473683]
[13,96.25,96.25,10.38961038961039,1,10.38961038961039]
[14,97.5,97.5,10.256410256410257,1,10.256410256410257]
[15,98.75,98.75,10.126582278481013,1,10.126582278481013]
[16,100,100,10,1,10]
[17,101.25,101.25,9.8765432098765427,1,9.8765432098765427]
[18,102.5,102.5,9.7560975609756095,1,9.7560975609756095]
[19,103.75,103.75,9.6385542168674707,1,9.6385542168674707]
[20,105,105,9.5238095238095237,1,9.5238095238095255]
[21,106.25,106.25,9.4117647058823533,1,9.4117647058823515]
[22,107.5,107.5,9.3023255813953494,1,9.3023255813953494]
[23,108.75,108.75,9.1954022988505741,1,9.1954022988505741]
[24,110,110,9.0909090909090917,1,9.0909090909090899]
[25,111.25,111.25,8.9887640449438209,1,8.9887640449438209]
[26,112.5,112.5,8.8888888888888893,1,8.8888888888888893]
[27,113.75,113.75,8.791208791208792,1,8.791208791208792]
[28,115,115,8.695652173913043,1,8.695652173913043]
[29,116.25,116.25,8.6021505376344081,1,8.6021505376344081]
[30,117.5,117.5,8.5106382978723403,1,8.5106382978723403]
[31,118.75,118.75,8.4210526315789469,1,8.4210526315789469]
[32,120,120,8.3333333333333339,1,8.3333333333333339]
[33,121.25,121.25,8.2474226804123703,1,8.247422680412372]
[34,122.5,122.5,8.1632653061224492,1,8.1632653061224492]
[35,123.75,123.75,8.0808080808080813,1,8.0808080808080813]
{"$rows_left_out":330}
{"sheet":"Data Type","index":4,"n_rows":36,"n_cols":9,"rows_kept":36,"cut":false,"hidden":true,"merged":[]}
[null,null,"Tx",null,null,null,"Rx"]
[null,"Data Type","Bits/pixel","(Odd lines)","Pixels/clock","(Odd lines)","Bits/pixel","Pixels/clock","Max HRES"]
[null,"RAW10",10,"",6,"",10,4,4608]
[null,"RAW12",12,"",5,"",12,4,3840]
[null,"RAW14",14,"",4,"",14,4,3288]
[null,"RAW6",6,"",10,"",6,8,7680]
[null,"RAW7",7,"",8,"",7,8,6576]
[null,"RAW8",8,"",8,"",8,8,5760]
[null,"RGB444",12,"",4,"",12,4,2880]
[null,"RGB555",15,"",4,"",15,4,2880]
[null,"RGB565",16,"",4,"",16,4,2880]
[null,"RGB666",18,"",3,"",18,3,2556]
[null,"RGB888",24,"",2,"",24,2,1920]
[null,"User Defined",8,"",8,"",8,8,5760]
[null,"YUV 420 10-bit",20,10,2,6,20,2,1920]
[null,"YUV 420 8-bit",16,8,4,8,16,4,1920]
[null,"YUV 420 8-bit (Legacy)",12,"",4,"",12,4,3840]
[null,"YUV 422 10-bit",20,"",2,"",20,2,2304]
[null,"YUV 422 8-bit",16,"",4,"",16,4,2880]
[]
[]
[]
[]
[]
[null,"Clock Mode"]
[null,"Continuous"]
[null,"Non-continuous"]
[]
[null,"Frame Mode"]
[null,"General"]
[null,"Accurate"]
[]
[null,"Number of Lanes"]
[null,1]
[null,2]
[null,4]

{"sheet":"W Dummy","index":5,"n_rows":49,"n_cols":15,"rows_kept":49,"cut":false,"hidden":true,"merged":[[14,2,14,14],[15,2,15,14],[16,2,16,14],[17,2,17,14],[1,7,1,12],[9,2,9,14],[10,2,10,14],[11,2,11,14],[12,2,12,14],[13,2,13,14]]}
[]
[null,null,null,null,null,null,null,"Blanking Calculation"]
[]
[]
[]
[]
[]
["Variable Parameters List","Values",null,null,null,null,"Editable"]
[]
["Byte clock in ns",{"$f":"(8/B15)","v":5.333333333333333},"DPHY TX Byte Clock duration in nanoseconds"]
["Phy Delay in ns",{"$f":"'DYNAMIC HRES GEN'!H1","v":1586},"Duration between TxRequestHS high and TxReadyHS high"]
["Phy Stop state Delay in ns",0,"Duration between TxRequestHS low and stopstate high"]
["No. of HS Packets",1,"Number of HS packets to be transmitted between hsync. \n4-> one LS packet, one LE packet, and one image long packet \nNote: Set 1 for GENERIC mode with. set 3 for ACCURATE mode"]
["No. of Short Pkt Bytes",{"$f":"(B13*4)/B17","v":1},"No of byte clocks required to send the short packets."]
[" PHY Speed in Gbps",{"$f":"('MIPI TX'!C12)/1000","v":1.5},"PHY speed in GBPS"]
["Camera datarate in Gbps",{"$f":"('MIPI TX'!C12)/1000","v":1.5},"Datarate at camera interafce in GBPS"]
["No. of Lane's",4,"Number of lanes"]
["Pixel count (Haddr)",{"$f":"'MIPI TX'!C4","v":1920},"No of pixel per line."]
[]
["Datatype","No. of Bits per clock","Number of Pixels","Pixel clock  in ns","No. of Bytes  ","No. of Bytes +2 (CRC)  ","No. of Bytes ","PPI line time in ns ","PPI line time in ns with overhead time","Total Line Pixel clock ","Total Blanking ","Total Blanking ","HBP in pixel clock","HFP in pixel clock","HSYNC in pixel clock"]
["Raw6",60,10,{"$f":"(B21/B$16)*(1/B$17)","v":10},{"$f":"(B18*3)/4","v":1440},{"$f":"E21+2","v":1442},{"$f":"ROUNDUP((F21/B$17),0)","v":361},{"$f":"(B$10*G21)+(B$10*B$14)+(B$11*B$13)+(B$12*B$13)","v":3516.6666666666665},{"$f":"(H21*130)/100","v":4571.6666666666661},{"$f":"ROUND((I21/D21),0)","v":457},{"$f":"J21-(B$18/10)","v":265},{"$f":"IF(K21<100,100,K21)","v":265},{"$f":"ROUNDUP((L21/10*6),0)","v":159},{"$f":"ROUNDUP(((L21/10*3)),0)","v":80},{"$f":"ROUNDUP(((L21/10)),0)","v":27}]
["Raw7",56,8,9.3333333333333339,{"$f":"(B18*7)/8","v":1680},1682,421,3836.6666666666665,{"$f":"(H22*130)/100","v":4987.6666666666661},{"$f":"ROUND((I22/D22),0)","v":534},{"$f":"J22-(B$18/8)","v":294},{"$f":"IF(K22<100,100,K22)","v":294},{"$f":"ROUNDUP((L22/10*6),0)","v":177},{"$f":"ROUNDUP(((L22/10*3)),0)","v":89},{"$f":"ROUNDUP(((L22/10)),0)","v":30}]
["Raw8",64,8,{"$f":"(B23/B$16)*(1/B$17)","v":10.666666666666666},{"$f":"B18","v":1920},{"$f":"E23+2","v":1922},{"$f":"ROUNDUP((F23/B$17),0)","v":481},{"$f":"(B$10*G23)+(B$10*B$14)+(B$11*B$13)+(B$12*B$13)","v":4156.6666666666661},{"$f":"(H23*132)/100","v":5486.7999999999993},514,{"$f":"J23-(B$18/8)","v":274},274,165,83,28]
["Raw10",60,6,{"$f":"(B24/B16)*(1/B17)","v":10},{"$f":"B18/4 *5","v":2400},{"$f":"E24+2","v":2402},{"$f":"ROUNDUP((F24/B17),0)","v":601},{"$f":"(B$10*G24)+(B$10*B$14)+(B$11*B$13)+(B$12*B$13)","v":4796.6666666666661},6235.6666666666661,624,{"$f":"J24-(B18/6)","v":304},304,183,92,31]
["Raw12",60,5,{"$f":"(B25/B16)*(1/B17)","v":10},{"$f":"B18/2 *3","v":2880},2882,{"$f":"ROUNDUP((F25/B17),0)","v":721},{"$f":"(B10*G25)+(B10*B14)+(B11*B13)+(B12*B13)","v":5436.6666666666661},7067.6666666666661,707,{"$f":"J25-(B18/5)","v":323},323,194,97,33]
["Raw14",56,4,{"$f":"(B26/B16)*(1/B17)","v":9.3333333333333339},{"$f":"B18/4 *7","v":3360},3362,{"$f":"ROUNDUP((F26/B17),0)","v":841},{"$f":"(B10*G26)+(B10*B14)+(B11*B13)+(B12*B13)","v":6076.6666666666661},7899.6666666666661,846,{"$f":"J26-(B18/4)","v":366},366,220,110,37]
["User Defined",64,8,{"$f":"(B27/B16)*(1/B17)","v":10.666666666666666},{"$f":"B$18","v":1920},1922,{"$f":"ROUNDUP((F27/B17),0)","v":481},{"$f":"(B10*G27)+(B10*B14)+(B11*B13)+(B12*B13)","v":4156.6666666666661},5403.6666666666661,507,{"$f":"J27-(B$18/8)","v":267},267,161,81,27]
["User_Def 2 - 10-7-10",64,8,{"$f":"(B28/B16)*(1/B17)","v":10.666666666666666},{"$f":"B$18","v":1920},1922,{"$f":"ROUNDUP((F28/B17),0)","v":481},{"$f":"(B10*G28)+(B10*B14)+(B11*B13)+(B12*B13)","v":4156.6666666666661},5403.6666666666661,507,{"$f":"J28-(B$18/8)","v":267},267,161,81,27]
["User_Def 3 - 10-8-10",64,8,{"$f":"(B29/B16)*(1/B17)","v":10.666666666666666},1920,1922,{"$f":"ROUNDUP((F29/B17),0)","v":481},{"$f":"(B10*G29)+(B10*B14)+(B11*B13)+(B12*B13)","v":4156.6666666666661},5403.6666666666661,507,267,267,161,81,27]
["User_Def 4 - 12-6-12",64,8,{"$f":"(B30/B16)*(1/B17)","v":10.666666666666666},1920,1922,{"$f":"ROUNDUP((F30/B17),0)","v":481},{"$f":"(B10*G30)+(B10*B14)+(B11*B13)+(B12*B13)","v":4156.6666666666661},5403.6666666666661,507,267,267,161,81,27]
["User_Def 5 - 12-7-12",64,8,{"$f":"(B31/B16)*(1/B17)","v":10.666666666666666},1920,1922,{"$f":"ROUNDUP((F31/B17),0)","v":481},{"$f":"(B10*G31)+(B10*B14)+(B11*B13)+(B12*B13)","v":4156.6666666666661},5403.6666666666661,507,267,267,161,81,27]
["User_Def 6 - 12-8-12",64,8,{"$f":"(B32/B16)*(1/B17)","v":10.666666666666666},1920,1922,{"$f":"ROUNDUP((F32/B17),0)","v":481},{"$f":"(B10*G32)+(B10*B14)+(B11*B13)+(B12*B13)","v":4156.6666666666661},5403.6666666666661,507,267,267,161,81,27]
["User_Def 7 - 12-10-12",64,8,{"$f":"(B33/B16)*(1/B17)","v":10.666666666666666},1920,1922,{"$f":"ROUNDUP((F33/B17),0)","v":481},{"$f":"(B10*G33)+(B10*B14)+(B11*B13)+(B12*B13)","v":4156.6666666666661},5403.6666666666661,507,267,267,161,81,27]
["User_Def 8",64,8,{"$f":"(B34/B$16)*(1/B$17)","v":10.666666666666666},1920,1922,{"$f":"ROUNDUP((F34/B$17),0)","v":481},{"$f":"(B$10*G34)+(B$10*B$14)+(B$11*B$13)+(B$12*B$13)","v":4156.6666666666661},5403.6666666666661,507,{"$f":"J34-(B$18/C34)","v":267},267,161,81,27]
["RGB444",48,4,{"$f":"(B35/B$16)*(1/B$17)","v":8},{"$f":"B$18*2","v":3840},3842,{"$f":"ROUNDUP((F35/B$17),0)","v":961},{"$f":"(B$10*G35)+(B$10*B$14)+(B$11*B$13)+(B$12*B$13)","v":6716.6666666666661},8731.6666666666661,1091,{"$f":"J35-(B$18/C35)","v":611},611,367,184,62]
["RGB555",60,4,10,3840,3842,961,6716.6666666666661,8731.6666666666661,873,393,393,236,118,40]
["RGB565",64,4,10.666666666666666,3840,3842,961,6716.6666666666661,8731.6666666666661,819,339,339,204,102,34]
["RGB666",54,3,9,{"$f":"(B$18*9)/4","v":4320},4322,1081,7356.6666666666661,9563.6666666666661,1063,423,423,254,127,43]
["YUV 420 8-bit (Legacy)",48,4,8,{"$f":"(B18/2)*3","v":2880},2882,721,5436.6666666666661,7067.6666666666661,883,403,403,242,121,41]
["YUV 422 8-bit",64,4,10.666666666666666,{"$f":"B$18*2","v":3840},3842,961,6716.6666666666661,8731.6666666666661,819,339,339,204,102,34]
{"$rows_left_out":10}
{"sheet":"Revision History","index":6,"n_rows":6,"n_cols":3,"rows_kept":6,"cut":false,"hidden":false,"merged":[]}
["Date","Version","Description"]
["2020-05-21","1.0","Initial release."]
["2020-06-09",1.1000000000000001,"Added MIPI RX"]
["2020-12-10",1.2,"Added reference waveform for dynamic HRES"]
["2021-12-08",1.3,"Data Type formula for RAW10 correction."]
["2023-07-03",1.4,"Fixed Dynamic Hres Gen tools forever loop."]