{"text_format":"1","workbook":"xlsx","n_sheets":7,"sheets":["MIPI TX","MIPI RX","DYNAMIC HRES GEN","step","Data Type","W Dummy","Revision History"],"not_rendered":{"charts":0,"images":3,"macros":1,"external_links":0,"defined_names":7,"comments":1,"pivot_tables":0},"unopened":[],"bounds":{"document_bytes":16777216,"sheet_cells":100000,"rows_first":2000,"rows_last":500,"rows_between":2000,"halvings":0,"cell_chars":16384,"cell_head_chars":4096},"cells_cut":0,"cells_raw":0,"read":"whole","date_system":"1900"}

{"sheet":"MIPI TX","index":0,"n_rows":564,"n_cols":9,"rows_kept":564,"cut":false,"hidden":false,"merged":[[5,12,6,21],[0,0,0,1],[0,2,0,3],[0,4,0,5],[2,10,3,11],[3,12,4,21],[2,12,2,21],[1,12,1,21]]}
[null,null,"MIPI Transmitter Utility"]
[null,"Enter the video information",null,null,null,"Input fields"]
[null,"Data type","RAW10"]
[null,"# of data pixels per line",1920]
[null,"# of data lines per frame",1080]
[null,"# of blanking lines per frame",3,null,{"$f":"C6*C42","v":24.599999999999998}]
[null,"# of frames per second (Hz)",60]
[null,"Horizontal blanking per line (us)",5,{"$f":"IF(OR(C3='Data Type'!B15,C3='Data Type'!B16),\"Enter the value of the even lines. You should apply the same line rate to odd and even lines.\",\"\")","v":""}]
[null,"Pixel clock frequency (MHz)",100]
[]
[null,"Enter the MIPI interface details"]
[null,"Data rate (Mbps)",1500]
[null,"# of lanes",4]
[null,"Frame Mode","General",null,null,null,null,null,"Hidden to customers; always General"]
[null,"Clock mode","Continuous"]
[]
[null,"Enter the TX timing parameter settings"]
[null,"TxClkEsc Frequency (MHz)",20,null,null,null,null,null,"Hidden to customers; always 20"]
[null,"THS-PREPARE (ns)",66]
[null,"THS-ZERO (ns)",150]
[null,"THS-TRAIL (ns)",970]
[null,"TCLK-POST (ns)",249]
[null,"TCLK-TRAIL (ns)",64]
[null,"TCLK-PREPARE (ns)",56]
[null,"TCLK-ZERO (ns)",320]
[null,"TCLK-PRE (ns)",300]
[]
[null,"Use default values",true,null,null,null,null,null,"Hidden to customers"]
[null,null,null,null,null,null,null,null,"Hidden to customers"]
[null,"Pixel data (based on the data type)",null,null,null,null,null,null,"Hidden to customers"]
[null,"YUV 420?",{"$f":"OR(C3='Data Type'!B15,C3='Data Type'!B16)","v":false},null,null,null,null,null,"Hidden to customers"]
[null,"YUV?",{"$f":"OR(C3='Data Type'!B15,C3='Data Type'!B16,C3='Data Type'!B17,C3='Data Type'!B18,C3='Data Type'!B19)","v":false},null,null,null,null,null,"Hidden to customers"]
[null,"Maximum # of pixels per line",{"$f":"VLOOKUP($C$3,'Data Type'!B3:I19,8)","v":4608},null,null,null,null,null,"Hidden to customers"]
[null,{"$f":"IF(C31,\"# of pixels per pixel clock (even lines)\",\"# of pixels per pixel clock\")","v":"# of pixels per pixel clock"},{"$f":"VLOOKUP($C$3,'Data Type'!B3:F19,4)","v":6},{"$f":"IF(C32,\"(on average)\",\"\")","v":""},null,null,null,null,"Hidden to customers"]
[null,{"$f":"IF(C31,\"# of bits per pixel (even lines)\",\"# of bits per pixel\")","v":"# of bits per pixel"},{"$f":"VLOOKUP($C$3,'Data Type'!B3:F19,2)","v":10},{"$f":"IF(C32,\"(on average)\",\"\")","v":""},null,null,null,null,"Hidden to customers"]
[null,{"$f":"IF(C31,\"# of pixels per pixel clock (odd lines)\",\"\")","v":""},{"$f":"VLOOKUP($C$3,'Data Type'!B3:F19,5)","v":""},null,null,null,null,null,"Hidden to customers"]
[null,{"$f":"IF(C31,\"# of bits per pixel (odd lines)\",\"\")","v":""},{"$f":"VLOOKUP($C$3,'Data Type'!B3:F19,3)","v":""},null,null,null,null,null,"Hidden to customers"]
[null,"# of bits per line",{"$f":"C4*C35","v":19200},{"$f":"IF(C31,\"(even lines)\",\"\")","v":""},null,null,null,null,"Hidden to customers"]
[null,"BW overhead spec",0.1,null,null,null,null,null,"Hidden to customers"]
[null,"Minimum Line Rate (kHz)",{"$f":"(C5+C6)*C7/1000","v":64.98},null,null,null,null,null,"Hidden to customers"]
[null,"Line rate margin (kHz)",{"$f":"1000/C42-C40","v":56.971219512195134},null,null,null,null,null,"Hidden to customers"]
[null,"Line Period (us)",{"$f":"C4/C9/C34+C8","v":8.1999999999999993},null,{"$f":"'W Dummy'!I23","v":5486.7999999999993},null,null,null,"Hidden to customers"]
[null,"Video Bandwidth (Mbps)",{"$f":"C4*C35/C42","v":2341.4634146341464},null,null,null,null,null,"Hidden to customers"]
[null,null,null,null,null,null,null,null,"Hidden to customers"]
[null,"Minimum Serial Bandwidth (Mbps)",{"$f":"C43*(1+C39)","v":2575.6097560975613},null,null,null,null,null,"Hidden to customers"]
[null,"MIPI Tx UI (ns)",{"$f":"1000/C12","v":0.66666666666666663},null,null,null,null,null,"Hidden to customers"]
[null,"Step size (ns)",{"$f":"VLOOKUP(C12,step!$B$5:$F$369,5)","v":8},null,null,null,null,null,"Hidden to customers"]
[null,"TxClkEsc Period (ns)",{"$f":"1000/C18","v":50},null,null,null,null,null,"Hidden to customers"]
[null,"TLPX (ns)",50,null,null,null,null,null,"Hidden to customers"]
[null,"THS-EXIT (ns)",250,null,null,null,null,null,"Hidden to customers"]
[null,"THS-EXIT-clock (ns)",800,null,null,null,null,null,"Hidden to customers"]
[null,"Data Packet overhead (ns)",{"$f":"C49+C19+C20+C21","v":1236},null,null,null,null,null,"Hidden to customers"]
[null,"LS/LE packets overhead (ns)",{"$f":"IF(C14=\"Accurate\",2*C52+2*C50,0)","v":0},null,null,null,null,null,"Hidden to customers"]
[null,"LP Clock overhead (ns)",{"$f":"IF(C15=\"Continuous\",C50,C49+C22+C23+C51+C24+C25+C26)","v":250},null,null,null,null,null,"Hidden to customers"]
[null,"TOTAL overhead (us)",{"$f":"(C52+C53+C54)/1000","v":1.486},null,null,null,null,null,"Hidden to customers"]
[null,"Time to transmit one even line (us)",{"$f":"C35*C4/C12/C13 + C55","v":4.6859999999999999},null,null,null,null,null,"Hidden to customers"]
[null,"Time to transmit one odd line (us)",{"$f":"IF(C31,C37*C4/C12/C13+C55,\"n/a\")","v":"n/a"},null,null,null,null,null,"Hidden to customers"]
[null,"Effective Serial Bandwidth (Mbps)",{"$f":"C35*C4/C56","v":4097.3111395646611},null,null,null,null,null,"Hidden to customers"]
[null,"Bandwidth margin (Mbps)",{"$f":"C58-C45","v":1521.7013834670997},null,null,null,null,null,"Hidden to customers"]
[null,null,null,null,null,null,null,null,"Hidden to customers"]
["Horizontal Blanking","Minimum hsync pulse (hsp) (us)",{"$f":"IF(C14=\"General\",2/C9,IF(C15=\"Continuous\",MAX(C52,80*C46+6*C48+300)/1000,MAX(C52,160*C46+12*C48+700)/1000))","v":0.02},null,null,null,null,null,"Hidden to customers"]
[null,"Maximum hsync pulse (hsp) (us)",{"$f":"IF(AND(C14=\"Accurate\",C15=\"Non-continuous\"),1.4*(160*C46+12*C48+700)/1000,\"n/a\")","v":"n/a"},null,null,null,null,null,"Hidden to customers"]
[null,"Minimum horiz. back porch (hbp) (us)",{"$f":"2/C9","v":0.02},{"$f":"IF(OR(C3='Data Type'!B15,C3='Data Type'!B16),\"To achieve the same line rate on odd and even lines, please extend the back porch of the odd lines while keeping the front porch constant.\",\"\")","v":""},null,null,null,null,"Hidden to customers"]
[null,"Maximum horiz. back porch (hbp) (us)",{"$f":"IF(AND(C14=\"Accurate\",C15=\"Non-continuous\"),(160*C46+12*C48+700)/1000,\"n/a\")","v":"n/a"},null,null,null,null,null,"Hidden to customers"]
[null,"Minimum horiz. front porch (hfp) (us)",{"$f":"2/C9","v":0.02},null,null,null,null,null,"Hidden to customers"]
[null,null,null,null,null,null,null,null,"Hidden to customers"]
[null,null,null,null,null,null,null,null,"Hidden to customers"]
[null,"Blanking margin (us)",{"$f":"C8-C61-C63-C65","v":4.9400000000000013},null,null,null,null,null,"Hidden to customers"]
[null,"Results"]
[null,"Maximum line buffer test",{"$f":"IF(C4>C33,\"Action Required\",\"PASS\")","v":"PASS"},{"$f":"IF(C70<>\"PASS\",\"Try a) decreasing the number of pixels per line, or b) selecting a different data type.\",\"\")","v":""}]
[null,"Minimum horizontal blanking test",{"$f":"IF(C68<0,\"Action Required\",\"PASS\")","v":"PASS"},{"$f":"IF(C71<>\"PASS\",\"Try a) increasing horizontal blanking, or b) increasing pixel clock frequency.\",\"\")","v":""}]
[null,"Minimum line rate test",{"$f":"IF(C41<0,\"Action Required\",\"PASS\")","v":"PASS"},{"$f":"IF(C72<>\"PASS\",\"Try decreasing horizontal blanking.\",\"\")","v":""}]
[null,"Minimum bandwidth test",{"$f":"IF(C59<0,\"Action Required\",\"PASS\")","v":"PASS"},{"$f":"IF(C73<>\"PASS\",\"Try a) using Continuous Clock Mode, or b) increasing horizontal blanking, or c) increasing data rate, or d) increasing number of data lanes.\",\"\")","v":""}]
[]
["© Efinix, Inc."]
[]
[]
[]
[]
[]
[null,"default","TCLK-POST (ns)","UI","Step","txclkesc","Bit setting",null,"Hidden to customers"]
[null,null,{"$f":"ROUNDDOWN(D82*$C$46+E82*$C$47+F82*$C$48,0)","v":113},86,7,0,"011",null,"Hidden to customers"]
[null,null,{"$f":"ROUNDDOWN(D83*$C$46+E83*$C$47+F83*$C$48,0)","v":121},86,8,0,"001",null,"Hidden to customers"]
[null,null,129,86,9,0,"000",null,"Hidden to customers"]
[null,null,137,86,10,0,"010",null,"Hidden to customers"]
[null,null,145,86,11,0,"100",null,"Hidden to customers"]
[null,null,169,86,14,0,"101",null,"Hidden to customers"]
[null,null,209,86,19,0,"110",null,"Hidden to customers"]
[null,true,249,86,24,0,"111",null,"Hidden to customers"]
[null,null,null,null,null,null,null,null,"Hidden to customers"]
[null,"default","TCLK-TRAIL (ns)","UI","Step","txclkesc","Bit setting",null,"Hidden to customers"]
[null,null,{"$f":"ROUNDDOWN(D92*$C$46+E92*$C$47+F92*$C$48,0)","v":16},0,2,0,"0001",null,"Hidden to customers"]
[null,null,24,0,3,0,"0010",null,"Hidden to customers"]
[null,null,32,0,4,0,"0011",null,"Hidden to customers"]
[null,null,40,0,5,0,"0100",null,"Hidden to customers"]
[null,null,48,0,6,0,"0101",null,"Hidden to customers"]
[null,null,56,0,7,0,"0110",null,"Hidden to customers"]
[null,true,64,0,8,0,"0000",null,"Hidden to customers"]
[null,null,72,0,9,0,"1000",null,"Hidden to customers"]
[null,null,80,0,10,0,"1001",null,"Hidden to customers"]
[null,null,88,0,11,0,"1010",null,"Hidden to customers"]
[null,null,96,0,12,0,"1011",null,"Hidden to customers"]
[null,null,104,0,13,0,"1100",null,"Hidden to customers"]
[null,null,112,0,14,0,"1101",null,"Hidden to customers"]
[null,null,null,null,null,null,null,null,"Hidden to customers"]
[null,"default","TCLK-PREPARE (ns)","UI","Step","txclkesc","Bit setting",null,"Hidden to customers"]
[null,null,{"$f":"ROUNDDOWN(D107*$C$46+E107*$C$47+F107*$C$48,0)","v":48},0,6,0,"01",null,"Hidden to customers"]
[null,true,56,0,7,0,"00",null,"Hidden to customers"]
[null,null,64,0,8,0,"10",null,"Hidden to customers"]
[null,null,72,0,9,0,"11",null,"Hidden to customers"]
[null,null,null,null,null,null,null,null,"Hidden to customers"]
[null,"default","TCLK-ZERO (ns)","UI","Step","txclkesc","Bit setting",null,"Hidden to customers"]
[null,null,{"$f":"ROUNDDOWN(D113*$C$46+E113*$C$47+F113*$C$48,0)","v":304},0,38,0,"011",null,"Hidden to customers"]
[null,null,312,0,39,0,"001",null,"Hidden to customers"]
[null,true,320,0,40,0,"000",null,"Hidden to customers"]
[null,null,328,0,41,0,"010",null,"Hidden to customers"]
[null,null,336,0,42,0,"100",null,"Hidden to customers"]
[null,null,360,0,45,0,"101",null,"Hidden to customers"]
[null,null,400,0,50,0,"110",null,"Hidden to customers"]
[null,null,440,0,55,0,"111",null,"Hidden to customers"]
[null,null,null,null,null,null,null,null,"Hidden to customers"]
[null,"default","TCLK-PRE (ns)","UI","Step","txclkesc","Bit setting",null,"Hidden to customers"]
[null,null,{"$f":"ROUNDDOWN(D123*$C$46+E123*$C$47+F123*$C$48,0)","v":250},0,0,5,"01",null,"Hidden to customers"]
[null,true,300,0,0,6,"00",null,"Hidden to customers"]
[null,null,400,0,0,8,"10",null,"Hidden to customers"]
[null,null,550,0,0,11,"11",null,"Hidden to customers"]
[null,null,null,null,null,null,null,null,"Hidden to customers"]
[null,"default","THS-PREPARE (ns)","UI","Step","txclkesc","Bit setting",null,"Hidden to customers"]
[null,null,{"$f":"ROUNDDOWN(D129*$C$46+E129*$C$47+F129*$C$48,0)","v":58},4,7,0,"10",null,"Hidden to customers"]
[null,true,66,4,8,0,"00",null,"Hidden to customers"]
[null,null,74,4,9,0,"01",null,"Hidden to customers"]
[null,null,90,4,11,0,"11",null,"Hidden to customers"]
[null,null,null,null,null,null,null,null,"Hidden to customers"]
[null,"default","THS-ZERO (ns)","UI","Step","txclkesc","Bit setting",null,"Hidden to customers"]
[null,null,{"$f":"ROUNDDOWN(D135*$C$46+E135*$C$47+F135*$C$48,0)","v":142},45,14,0,"01",null,"Hidden to customers"]
[null,true,150,45,15,0,"00",null,"Hidden to customers"]
[null,null,190,45,20,0,"10",null,"Hidden to customers"]
[null,null,230,45,25,0,"11",null,"Hidden to customers"]
[null,null,null,null,null,null,null,null,"Hidden to customers"]
[null,"default","THS-TRAIL (ns)","UI","Step","txclkesc","Bit setting",null,"Hidden to customers"]
[null,null,{"$f":"ROUNDDOWN(D141*$C$46+E141*$C$47+F141*$C$48,0)","v":34},4,4,0,"00100",null,"Hidden to customers"]
[null,null,42,4,5,0,"00011",null,"Hidden to customers"]
[null,null,50,4,6,0,"00010",null,"Hidden to customers"]
[null,null,58,4,7,0,"00001",null,"Hidden to customers"]
[null,null,66,4,8,0,"00000",null,"Hidden to customers"]
[null,null,74,4,9,0,"10001",null,"Hidden to customers"]
[null,null,82,4,10,0,"10010",null,"Hidden to customers"]
[null,null,90,4,11,0,"10011",null,"Hidden to customers"]
[null,null,98,4,12,0,"10100",null,"Hidden to customers"]
[null,null,106,4,13,0,"10101",null,"Hidden to customers"]
[null,null,114,4,14,0,"10110",null,"Hidden to customers"]
[null,null,122,4,15,0,"10111",null,"Hidden to customers"]
[null,null,130,4,16,0,"11000",null,"Hidden to customers"]
[null,null,138,4,17,0,"11001",null,"Hidden to customers"]
[null,null,146,4,18,0,"11010",null,"Hidden to customers"]
[null,null,154,4,19,0,"11011",null,"Hidden to customers"]
[null,null,162,4,20,0,"11100",null,"Hidden to customers"]
[null,null,170,4,21,0,"11101",null,"Hidden to customers"]
[null,null,178,4,22,0,"11110",null,"Hidden to customers"]
[null,null,186,4,23,0,"11111",null,"Hidden to customers"]
[null,true,970,4,121,0,"01111",null,"Hidden to customers"]
[]
[]
[]
[]
[]
[]
[]
[]
[]
[]
[]
[]
[]
[]
[]
[]
[]
[]
[]
[]
[]
[]
[]
[]
[]
[]
[]
[]
[]
[]
[]
[]
[]
[]
[]
[]
[]
[]
[null,{"$f":"step!B5","v":80},null,null,null,null,null,null,"Hidden to customers"]
[null,{"$f":"step!B6","v":81.25},null,null,null,null,null,null,"Hidden to customers"]
[null,{"$f":"step!B7","v":82.5},null,null,null,null,null,null,"Hidden to customers"]
[null,{"$f":"step!B8","v":83.75},null,null,null,null,null,null,"Hidden to customers"]
[null,{"$f":"step!B9","v":85},null,null,null,null,null,null,"Hidden to customers"]
[null,{"$f":"step!B10","v":86.25},null,null,null,null,null,null,"Hidden to customers"]
[null,{"$f":"step!B11","v":87.5},null,null,null,null,null,null,"Hidden to customers"]
[null,{"$f":"step!B12","v":88.75},null,null,null,null,null,null,"Hidden to customers"]
[null,{"$f":"step!B13","v":90},null,null,null,null,null,null,"Hidden to customers"]
[null,{"$f":"step!B14","v":91.25},null,null,null,null,null,null,"Hidden to customers"]
[null,{"$f":"step!B15","v":92.5},null,null,null,null,null,null,"Hidden to customers"]
[null,{"$f":"step!B16","v":93.75},null,null,null,null,null,null,"Hidden to customers"]
[null,{"$f":"step!B17","v":95},null,null,null,null,null,null,"Hidden to customers"]
[null,{"$f":"step!B18","v":96.25},null,null,null,null,null,null,"Hidden to customers"]
[null,{"$f":"step!B19","v":97.5},null,null,null,null,null,null,"Hidden to customers"]
[null,{"$f":"step!B20","v":98.75},null,null,null,null,null,null,"Hidden to customers"]
[null,{"$f":"step!B21","v":100},null,null,null,null,null,null,"Hidden to customers"]
[null,{"$f":"step!B22","v":101.25},null,null,null,null,null,null,"Hidden to customers"]
[null,{"$f":"step!B23","v":102.5},null,null,null,null,null,null,"Hidden to customers"]
[null,{"$f":"step!B24","v":103.75},null,null,null,null,null,null,"Hidden to customers"]
[null,{"$f":"step!B25","v":105},null,null,null,null,null,null,"Hidden to customers"]
[null,{"$f":"step!B26","v":106.25},null,null,null,null,null,null,"Hidden to customers"]
[null,{"$f":"step!B27","v":107.5},null,null,null,null,null,null,"Hidden to customers"]
[null,{"$f":"step!B28","v":108.75},null,null,null,null,null,null,"Hidden to customers"]
[null,{"$f":"step!B29","v":110},null,null,null,null,null,null,"Hidden to customers"]
[null,{"$f":"step!B30","v":111.25},null,null,null,null,null,null,"Hidden to customers"]
[null,{"$f":"step!B31","v":112.5},null,null,null,null,null,null,"Hidden to customers"]
[null,{"$f":"step!B32","v":113.75},null,null,null,null,null,null,"Hidden to customers"]
[null,{"$f":"step!B33","v":115},null,null,null,null,null,null,"Hidden to customers"]
[null,{"$f":"step!B34","v":116.25},null,null,null,null,null,null,"Hidden to customers"]
[null,{"$f":"step!B35","v":117.5},null,null,null,null,null,null,"Hidden to customers"]
[null,{"$f":"step!B36","v":118.75},null,null,null,null,null,null,"Hidden to customers"]
[null,{"$f":"step!B37","v":120},null,null,null,null,null,null,"Hidden to customers"]
[null,{"$f":"step!B38","v":121.25},null,null,null,null,null,null,"Hidden to customers"]
[null,{"$f":"step!B39","v":122.5},null,null,null,null,null,null,"Hidden to customers"]
[null,{"$f":"step!B40","v":123.75},null,null,null,null,null,null,"Hidden to customers"]
[null,{"$f":"step!B41","v":125},null,null,null,null,null,null,"Hidden to customers"]
[null,{"$f":"step!B42","v":126.25},null,null,null,null,null,null,"Hidden to customers"]
[null,{"$f":"step!B43","v":127.5},null,null,null,null,null,null,"Hidden to customers"]
[null,{"$f":"step!B44","v":128.75},null,null,null,null,null,null,"Hidden to customers"]
[null,{"$f":"step!B45","v":130},null,null,null,null,null,null,"Hidden to customers"]
[null,{"$f":"step!B46","v":131.25},null,null,null,null,null,null,"Hidden to customers"]
[null,{"$f":"step!B47","v":132.5},null,null,null,null,null,null,"Hidden to customers"]
[null,{"$f":"step!B48","v":133.75},null,null,null,null,null,null,"Hidden to customers"]
[null,{"$f":"step!B49","v":135},null,null,null,null,null,null,"Hidden to customers"]
[null,{"$f":"step!B50","v":136.25},null,null,null,null,null,null,"Hidden to customers"]
[null,{"$f":"step!B51","v":137.5},null,null,null,null,null,null,"Hidden to customers"]
[null,{"$f":"step!B52","v":138.75},null,null,null,null,null,null,"Hidden to customers"]
[null,{"$f":"step!B53","v":140},null,null,null,null,null,null,"Hidden to customers"]
[null,{"$f":"step!B54","v":141.25},null,null,null,null,null,null,"Hidden to customers"]
[null,{"$f":"step!B55","v":142.5},null,null,null,null,null,null,"Hidden to customers"]
[null,{"$f":"step!B56","v":143.75},null,null,null,null,null,null,"Hidden to customers"]
[null,{"$f":"step!B57","v":145},null,null,null,null,null,null,"Hidden to customers"]
[null,{"$f":"step!B58","v":146.25},null,null,null,null,null,null,"Hidden to customers"]
[null,{"$f":"step!B59","v":147.5},null,null,null,null,null,null,"Hidden to customers"]
[null,{"$f":"step!B60","v":148.75},null,null,null,null,null,null,"Hidden to customers"]
[null,{"$f":"step!B61","v":150},null,null,null,null,null,null,"Hidden to customers"]
[null,{"$f":"step!B62","v":151.25},null,null,null,null,null,null,"Hidden to customers"]
[null,{"$f":"step!B63","v":152.5},null,null,null,null,null,null,"Hidden to customers"]
[null,{"$f":"step!B64","v":153.75},null,null,null,null,null,null,"Hidden to customers"]
[null,{"$f":"step!B65","v":155},null,null,null,null,null,null,"Hidden to customers"]
[null,{"$f":"step!B66","v":156.25},null,null,null,null,null,null,"Hidden to customers"]
[null,{"$f":"step!B67","v":157.5},null,null,null,null,null,null,"Hidden to customers"]
[null,{"$f":"step!B68","v":158.75},null,null,null,null,null,null,"Hidden to customers"]
[null,{"$f":"step!B69","v":160},null,null,null,null,null,null,"Hidden to customers"]
[null,{"$f":"step!B70","v":162.5},null,null,null,null,null,null,"Hidden to customers"]
[null,{"$f":"step!B71","v":165},null,null,null,null,null,null,"Hidden to customers"]
[null,{"$f":"step!B72","v":167.5},null,null,null,null,null,null,"Hidden to customers"]
[null,{"$f":"step!B73","v":170},null,null,null,null,null,null,"Hidden to customers"]
[null,{"$f":"step!B74","v":172.5},null,null,null,null,null,null,"Hidden to customers"]
[null,{"$f":"step!B75","v":175},null,null,null,null,null,null,"Hidden to customers"]
[null,{"$f":"step!B76","v":177.5},null,null,null,null,null,null,"Hidden to customers"]
[null,{"$f":"step!B77","v":180},null,null,null,null,null,null,"Hidden to customers"]
[null,{"$f":"step!B78","v":182.5},null,null,null,null,null,null,"Hidden to customers"]
[null,{"$f":"step!B79","v":185},null,null,null,null,null,null,"Hidden to customers"]
[null,{"$f":"step!B80","v":187.5},null,null,null,null,null,null,"Hidden to customers"]
[null,{"$f":"step!B81","v":190},null,null,null,null,null,null,"Hidden to customers"]
[null,{"$f":"step!B82","v":192.5},null,null,null,null,null,null,"Hidden to customers"]
[null,{"$f":"step!B83","v":195},null,null,null,null,null,null,"Hidden to customers"]
[null,{"$f":"step!B84","v":197.5},null,null,null,null,null,null,"Hidden to customers"]
[null,{"$f":"step!B85","v":200},null,null,null,null,null,null,"Hidden to customers"]
[null,{"$f":"step!B86","v":202.5},null,null,null,null,null,null,"Hidden to customers"]
[null,{"$f":"step!B87","v":205},null,null,null,null,null,null,"Hidden to customers"]
[null,{"$f":"step!B88","v":207.5},null,null,null,null,null,null,"Hidden to customers"]
[null,{"$f":"step!B89","v":210},null,null,null,null,null,null,"Hidden to customers"]
[null,{"$f":"step!B90","v":212.5},null,null,null,null,null,null,"Hidden to customers"]
[null,{"$f":"step!B91","v":215},null,null,null,null,null,null,"Hidden to customers"]
[null,{"$f":"step!B92","v":217.5},null,null,null,null,null,null,"Hidden to customers"]
[null,{"$f":"step!B93","v":220},null,null,null,null,null,null,"Hidden to customers"]
[null,{"$f":"step!B94","v":222.5},null,null,null,null,null,null,"Hidden to customers"]
[null,{"$f":"step!B95","v":225},null,null,null,null,null,null,"Hidden to customers"]
[null,{"$f":"step!B96","v":227.5},null,null,null,null,null,null,"Hidden to customers"]
[null,{"$f":"step!B97","v":230},null,null,null,null,null,null,"Hidden to customers"]
[null,{"$f":"step!B98","v":232.5},null,null,null,null,null,null,"Hidden to customers"]
[null,{"$f":"step!B99","v":235},null,null,null,null,null,null,"Hidden to customers"]
[null,{"$f":"step!B100","v":237.5},null,null,null,null,null,null,"Hidden to customers"]
[null,{"$f":"step!B101","v":240},null,null,null,null,null,null,"Hidden to customers"]
[null,{"$f":"step!B102","v":242.5},null,null,null,null,null,null,"Hidden to customers"]
[null,{"$f":"step!B103","v":245},null,null,null,null,null,null,"Hidden to customers"]
[null,{"$f":"step!B104","v":247.5},null,null,null,null,null,null,"Hidden to customers"]
[null,{"$f":"step!B105","v":250},null,null,null,null,null,null,"Hidden to customers"]
[null,{"$f":"step!B106","v":252.5},null,null,null,null,null,null,"Hidden to customers"]
[null,{"$f":"step!B107","v":255},null,null,null,null,null,null,"Hidden to customers"]
[null,{"$f":"step!B108","v":257.5},null,null,null,null,null,null,"Hidden to customers"]
[null,{"$f":"step!B109","v":260},null,null,null,null,null,null,"Hidden to customers"]
[null,{"$f":"step!B110","v":262.5},null,null,null,null,null,null,"Hidden to customers"]
[null,{"$f":"step!B111","v":265},null,null,null,null,null,null,"Hidden to customers"]
[null,{"$f":"step!B112","v":267.5},null,null,null,null,null,null,"Hidden to customers"]
[null,{"$f":"step!B113","v":270},null,null,null,null,null,null,"Hidden to customers"]
[null,{"$f":"step!B114","v":272.5},null,null,null,null,null,null,"Hidden to customers"]
[null,{"$f":"step!B115","v":275},null,null,null,null,null,null,"Hidden to customers"]
[null,{"$f":"step!B116","v":277.5},null,null,null,null,null,null,"Hidden to customers"]
[null,{"$f":"step!B117","v":280},null,null,null,null,null,null,"Hidden to customers"]
[null,{"$f":"step!B118","v":282.5},null,null,null,null,null,null,"Hidden to customers"]
[null,{"$f":"step!B119","v":285},null,null,null,null,null,null,"Hidden to customers"]
[null,{"$f":"step!B120","v":287.5},null,null,null,null,null,null,"Hidden to customers"]
[null,{"$f":"step!B121","v":290},null,null,null,null,null,null,"Hidden to customers"]
[null,{"$f":"step!B122","v":292.5},null,null,null,null,null,null,"Hidden to customers"]
[null,{"$f":"step!B123","v":295},null,null,null,null,null,null,"Hidden to customers"]
[null,{"$f":"step!B124","v":297.5},null,null,null,null,null,null,"Hidden to customers"]
[null,{"$f":"step!B125","v":300},null,null,null,null,null,null,"Hidden to customers"]
[null,{"$f":"step!B126","v":302.5},null,null,null,null,null,null,"Hidden to customers"]
[null,{"$f":"step!B127","v":305},null,null,null,null,null,null,"Hidden to customers"]
[null,{"$f":"step!B128","v":307.5},null,null,null,null,null,null,"Hidden to customers"]
[null,{"$f":"step!B129","v":310},null,null,null,null,null,null,"Hidden to customers"]
[null,{"$f":"step!B130","v":312.5},null,null,null,null,null,null,"Hidden to customers"]
[null,{"$f":"step!B131","v":315},null,null,null,null,null,null,"Hidden to customers"]
[null,{"$f":"step!B132","v":317.5},null,null,null,null,null,null,"Hidden to customers"]
[null,{"$f":"step!B133","v":320},null,null,null,null,null,null,"Hidden to customers"]
[null,{"$f":"step!B134","v":325},null,null,null,null,null,null,"Hidden to customers"]
[null,{"$f":"step!B135","v":330},null,null,null,null,null,null,"Hidden to customers"]
[null,{"$f":"step!B136","v":335},null,null,null,null,null,null,"Hidden to customers"]
[null,{"$f":"step!B137","v":340},null,null,null,null,null,null,"Hidden to customers"]
[null,{"$f":"step!B138","v":345},null,null,null,null,null,null,"Hidden to customers"]
[null,{"$f":"step!B139","v":350},null,null,null,null,null,null,"Hidden to customers"]
[null,{"$f":"step!B140","v":355},null,null,null,null,null,null,"Hidden to customers"]
[null,{"$f":"step!B141","v":360},null,null,null,null,null,null,"Hidden to customers"]
[null,{"$f":"step!B142","v":365},null,null,null,null,null,null,"Hidden to customers"]
[null,{"$f":"step!B143","v":370},null,null,null,null,null,null,"Hidden to customers"]
[null,{"$f":"step!B144","v":375},null,null,null,null,null,null,"Hidden to customers"]
[null,{"$f":"step!B145","v":380},null,null,null,null,null,null,"Hidden to customers"]
[null,{"$f":"step!B146","v":385},null,null,null,null,null,null,"Hidden to customers"]
[null,{"$f":"step!B147","v":390},null,null,null,null,null,null,"Hidden to customers"]
[null,{"$f":"step!B148","v":395},null,null,null,null,null,null,"Hidden to customers"]
[null,{"$f":"step!B149","v":400},null,null,null,null,null,null,"Hidden to customers"]
[null,{"$f":"step!B150","v":405},null,null,null,null,null,null,"Hidden to customers"]
[null,{"$f":"step!B151","v":410},null,null,null,null,null,null,"Hidden to customers"]
[null,{"$f":"step!B152","v":415},null,null,null,null,null,null,"Hidden to customers"]
[null,{"$f":"step!B153","v":420},null,null,null,null,null,null,"Hidden to customers"]
[null,{"$f":"step!B154","v":425},null,null,null,null,null,null,"Hidden to customers"]
[null,{"$f":"step!B155","v":430},null,null,null,null,null,null,"Hidden to customers"]
[null,{"$f":"step!B156","v":435},null,null,null,null,null,null,"Hidden to customers"]
[null,{"$f":"step!B157","v":440},null,null,null,null,null,null,"Hidden to customers"]
[null,{"$f":"step!B158","v":445},null,null,null,null,null,null,"Hidden to customers"]
[null,{"$f":"step!B159","v":450},null,null,null,null,null,null,"Hidden to customers"]
[null,{"$f":"step!B160","v":455},null,null,null,null,null,null,"Hidden to customers"]
[null,{"$f":"step!B161","v":460},null,null,null,null,null,null,"Hidden to customers"]
[null,{"$f":"step!B162","v":465},null,null,null,null,null,null,"Hidden to customers"]
[null,{"$f":"step!B163","v":470},null,null,null,null,null,null,"Hidden to customers"]
[null,{"$f":"step!B164","v":475},null,null,null,null,null,null,"Hidden to customers"]
[null,{"$f":"step!B165","v":480},null,null,null,null,null,null,"Hidden to customers"]
[null,{"$f":"step!B166","v":485},null,null,null,null,null,null,"Hidden to customers"]
[null,{"$f":"step!B167","v":490},null,null,null,null,null,null,"Hidden to customers"]
[null,{"$f":"step!B168","v":495},null,null,null,null,null,null,"Hidden to customers"]
[null,{"$f":"step!B169","v":500},null,null,null,null,null,null,"Hidden to customers"]
[null,{"$f":"step!B170","v":505},null,null,null,null,null,null,"Hidden to customers"]
[null,{"$f":"step!B171","v":510},null,null,null,null,null,null,"Hidden to customers"]
[null,{"$f":"step!B172","v":515},null,null,null,null,null,null,"Hidden to customers"]
[null,{"$f":"step!B173","v":520},null,null,null,null,null,null,"Hidden to customers"]
[null,{"$f":"step!B174","v":525},null,null,null,null,null,null,"Hidden to customers"]
[null,{"$f":"step!B175","v":530},null,null,null,null,null,null,"Hidden to customers"]
[null,{"$f":"step!B176","v":535},null,null,null,null,null,null,"Hidden to customers"]
[null,{"$f":"step!B177","v":540},null,null,null,null,null,null,"Hidden to customers"]
[null,{"$f":"step!B178","v":545},null,null,null,null,null,null,"Hidden to customers"]
[null,{"$f":"step!B179","v":550},null,null,null,null,null,null,"Hidden to customers"]
[null,{"$f":"step!B180","v":555},null,null,null,null,null,null,"Hidden to customers"]
[null,{"$f":"step!B181","v":560},null,null,null,null,null,null,"Hidden to customers"]
[null,{"$f":"step!B182","v":565},null,null,null,null,null,null,"Hidden to customers"]
[null,{"$f":"step!B183","v":570},null,null,null,null,null,null,"Hidden to customers"]
[null,{"$f":"step!B184","v":575},null,null,null,null,null,null,"Hidden to customers"]
[null,{"$f":"step!B185","v":580},null,null,null,null,null,null,"Hidden to customers"]
[null,{"$f":"step!B186","v":585},null,null,null,null,null,null,"Hidden to customers"]
[null,{"$f":"step!B187","v":590},null,null,null,null,null,null,"Hidden to customers"]
[null,{"$f":"step!B188","v":595},null,null,null,null,null,null,"Hidden to customers"]
[null,{"$f":"step!B189","v":600},null,null,null,null,null,null,"Hidden to customers"]
[null,{"$f":"step!B190","v":605},null,null,null,null,null,null,"Hidden to customers"]
[null,{"$f":"step!B191","v":610},null,null,null,null,null,null,"Hidden to customers"]
[null,{"$f":"step!B192","v":615},null,null,null,null,null,null,"Hidden to customers"]
[null,{"$f":"step!B193","v":620},null,null,null,null,null,null,"Hidden to customers"]
[null,{"$f":"step!B194","v":625},null,null,null,null,null,null,"Hidden to customers"]
[null,{"$f":"step!B195","v":630},null,null,null,null,null,null,"Hidden to customers"]
[null,{"$f":"step!B196","v":635},null,null,null,null,null,null,"Hidden to customers"]
[null,{"$f":"step!B197","v":640},null,null,null,null,null,null,"Hidden to customers"]
[null,{"$f":"step!B198","v":645},null,null,null,null,null,null,"Hidden to customers"]
[null,{"$f":"step!B199","v":650},null,null,null,null,null,null,"Hidden to customers"]
[null,{"$f":"step!B200","v":655},null,null,null,null,null,null,"Hidden to customers"]
[null,{"$f":"step!B201","v":660},null,null,null,null,null,null,"Hidden to customers"]
[null,{"$f":"step!B202","v":665},null,null,null,null,null,null,"Hidden to customers"]
[null,{"$f":"step!B203","v":670},null,null,null,null,null,null,"Hidden to customers"]
[null,{"$f":"step!B204","v":675},null,null,null,null,null,null,"Hidden to customers"]
[null,{"$f":"step!B205","v":680},null,null,null,null,null,null,"Hidden to customers"]
[null,{"$f":"step!B206","v":685},null,null,null,null,null,null,"Hidden to customers"]
[null,{"$f":"step!B207","v":690},null,null,null,null,null,null,"Hidden to customers"]
[null,{"$f":"step!B208","v":695},null,null,null,null,null,null,"Hidden to customers"]
[null,{"$f":"step!B209","v":700},null,null,null,null,null,null,"Hidden to customers"]
[null,{"$f":"step!B210","v":705},null,null,null,null,null,null,"Hidden to customers"]
[null,{"$f":"step!B211","v":710},null,null,null,null,null,null,"Hidden to customers"]
[null,{"$f":"step!B212","v":715},null,null,null,null,null,null,"Hidden to customers"]
[null,{"$f":"step!B213","v":720},null,null,null,null,null,null,"Hidden to customers"]
[null,{"$f":"step!B214","v":725},null,null,null,null,null,null,"Hidden to customers"]
[null,{"$f":"step!B215","v":730},null,null,null,null,null,null,"Hidden to customers"]
[null,{"$f":"step!B216","v":735},null,null,null,null,null,null,"Hidden to customers"]
[null,{"$f":"step!B217","v":740},null,null,null,null,null,null,"Hidden to customers"]
[null,{"$f":"step!B218","v":745},null,null,null,null,null,null,"Hidden to customers"]
[null,{"$f":"step!B219","v":750},null,null,null,null,null,null,"Hidden to customers"]
[null,{"$f":"step!B220","v":755},null,null,null,null,null,null,"Hidden to customers"]
[null,{"$f":"step!B221","v":760},null,null,null,null,null,null,"Hidden to customers"]
[null,{"$f":"step!B222","v":765},null,null,null,null,null,null,"Hidden to customers"]
[null,{"$f":"step!B223","v":770},null,null,null,null,null,null,"Hidden to customers"]
[null,{"$f":"step!B224","v":775},null,null,null,null,null,null,"Hidden to customers"]
[null,{"$f":"step!B225","v":780},null,null,null,null,null,null,"Hidden to customers"]
[null,{"$f":"step!B226","v":785},null,null,null,null,null,null,"Hidden to customers"]
[null,{"$f":"step!B227","v":790},null,null,null,null,null,null,"Hidden to customers"]
[null,{"$f":"step!B228","v":795},null,null,null,null,null,null,"Hidden to customers"]
[null,{"$f":"step!B229","v":800},null,null,null,null,null,null,"Hidden to customers"]
[null,{"$f":"step!B230","v":805},null,null,null,null,null,null,"Hidden to customers"]
[null,{"$f":"step!B231","v":810},null,null,null,null,null,null,"Hidden to customers"]
[null,{"$f":"step!B232","v":815},null,null,null,null,null,null,"Hidden to customers"]
[null,{"$f":"step!B233","v":820},null,null,null,null,null,null,"Hidden to customers"]
[null,{"$f":"step!B234","v":825},null,null,null,null,null,null,"Hidden to customers"]
[null,{"$f":"step!B235","v":830},null,null,null,null,null,null,"Hidden to customers"]
[null,{"$f":"step!B236","v":835},null,null,null,null,null,null,"Hidden to customers"]
[null,{"$f":"step!B237","v":840},null,null,null,null,null,null,"Hidden to customers"]
[null,{"$f":"step!B238","v":845},null,null,null,null,null,null,"Hidden to customers"]
[null,{"$f":"step!B239","v":850},null,null,null,null,null,null,"Hidden to customers"]
[null,{"$f":"step!B240","v":855},null,null,null,null,null,null,"Hidden to customers"]
[null,{"$f":"step!B241","v":860},null,null,null,null,null,null,"Hidden to customers"]
[null,{"$f":"step!B242","v":865},null,null,null,null,null,null,"Hidden to customers"]
[null,{"$f":"step!B243","v":870},null,null,null,null,null,null,"Hidden to customers"]
[null,{"$f":"step!B244","v":875},null,null,null,null,null,null,"Hidden to customers"]
[null,{"$f":"step!B245","v":880},null,null,null,null,null,null,"Hidden to customers"]
[null,{"$f":"step!B246","v":885},null,null,null,null,null,null,"Hidden to customers"]
[null,{"$f":"step!B247","v":890},null,null,null,null,null,null,"Hidden to customers"]
[null,{"$f":"step!B248","v":895},null,null,null,null,null,null,"Hidden to customers"]
[null,{"$f":"step!B249","v":900},null,null,null,null,null,null,"Hidden to customers"]
[null,{"$f":"step!B250","v":905},null,null,null,null,null,null,"Hidden to customers"]
[null,{"$f":"step!B251","v":910},null,null,null,null,null,null,"Hidden to customers"]
[null,{"$f":"step!B252","v":915},null,null,null,null,null,null,"Hidden to customers"]
[null,{"$f":"step!B253","v":920},null,null,null,null,null,null,"Hidden to customers"]
[null,{"$f":"step!B254","v":925},null,null,null,null,null,null,"Hidden to customers"]
[null,{"$f":"step!B255","v":930},null,null,null,null,null,null,"Hidden to customers"]
[null,{"$f":"step!B256","v":935},null,null,null,null,null,null,"Hidden to customers"]
[null,{"$f":"step!B257","v":940},null,null,null,null,null,null,"Hidden to customers"]
[null,{"$f":"step!B258","v":945},null,null,null,null,null,null,"Hidden to customers"]
[null,{"$f":"step!B259","v":950},null,null,null,null,null,null,"Hidden to customers"]
[null,{"$f":"step!B260","v":955},null,null,null,null,null,null,"Hidden to customers"]
[null,{"$f":"step!B261","v":960},null,null,null,null,null,null,"Hidden to customers"]
[null,{"$f":"step!B262","v":965},null,null,null,null,null,null,"Hidden to customers"]
[null,{"$f":"step!B263","v":970},null,null,null,null,null,null,"Hidden to customers"]
[null,{"$f":"step!B264","v":975},null,null,null,null,null,null,"Hidden to customers"]
[null,{"$f":"step!B265","v":980},null,null,null,null,null,null,"Hidden to customers"]
[null,{"$f":"step!B266","v":985},null,null,null,null,null,null,"Hidden to customers"]
[null,{"$f":"step!B267","v":990},null,null,null,null,null,null,"Hidden to customers"]
[null,{"$f":"step!B268","v":995},null,null,null,null,null,null,"Hidden to customers"]
[null,{"$f":"step!B269","v":1000},null,null,null,null,null,null,"Hidden to customers"]
[null,{"$f":"step!B270","v":1005},null,null,null,null,null,null,"Hidden to customers"]
[null,{"$f":"step!B271","v":1010},null,null,null,null,null,null,"Hidden to customers"]
[null,{"$f":"step!B272","v":1015},null,null,null,null,null,null,"Hidden to customers"]
[null,{"$f":"step!B273","v":1020},null,null,null,null,null,null,"Hidden to customers"]
[null,{"$f":"step!B274","v":1025},null,null,null,null,null,null,"Hidden to customers"]
[null,{"$f":"step!B275","v":1030},null,null,null,null,null,null,"Hidden to customers"]
[null,{"$f":"step!B276","v":1035},null,null,null,null,null,null,"Hidden to customers"]
[null,{"$f":"step!B277","v":1040},null,null,null,null,null,null,"Hidden to customers"]
[null,{"$f":"step!B278","v":1045},null,null,null,null,null,null,"Hidden to customers"]
[null,{"$f":"step!B279","v":1050},null,null,null,null,null,null,"Hidden to customers"]
[null,{"$f":"step!B280","v":1055},null,null,null,null,null,null,"Hidden to customers"]
[null,{"$f":"step!B281","v":1060},null,null,null,null,null,null,"Hidden to customers"]
[null,{"$f":"step!B282","v":1065},null,null,null,null,null,null,"Hidden to customers"]
[null,{"$f":"step!B283","v":1070},null,null,null,null,null,null,"Hidden to customers"]
[null,{"$f":"step!B284","v":1075},null,null,null,null,null,null,"Hidden to customers"]
[null,{"$f":"step!B285","v":1080},null,null,null,null,null,null,"Hidden to customers"]
[null,{"$f":"step!B286","v":1085},null,null,null,null,null,null,"Hidden to customers"]
[null,{"$f":"step!B287","v":1090},null,null,null,null,null,null,"Hidden to customers"]
[null,{"$f":"step!B288","v":1095},null,null,null,null,null,null,"Hidden to customers"]
[null,{"$f":"step!B289","v":1100},null,null,null,null,null,null,"Hidden to customers"]
[null,{"$f":"step!B290","v":1105},null,null,null,null,null,null,"Hidden to customers"]
[null,{"$f":"step!B291","v":1110},null,null,null,null,null,null,"Hidden to customers"]
[null,{"$f":"step!B292","v":1115},null,null,null,null,null,null,"Hidden to customers"]
[null,{"$f":"step!B293","v":1120},null,null,null,null,null,null,"Hidden to customers"]
[null,{"$f":"step!B294","v":1125},null,null,null,null,null,null,"Hidden to customers"]
[null,{"$f":"step!B295","v":1130},null,null,null,null,null,null,"Hidden to customers"]
[null,{"$f":"step!B296","v":1135},null,null,null,null,null,null,"Hidden to customers"]
[null,{"$f":"step!B297","v":1140},null,null,null,null,null,null,"Hidden to customers"]
[null,{"$f":"step!B298","v":1145},null,null,null,null,null,null,"Hidden to customers"]
[null,{"$f":"step!B299","v":1150},null,null,null,null,null,null,"Hidden to customers"]
[null,{"$f":"step!B300","v":1155},null,null,null,null,null,null,"Hidden to customers"]
[null,{"$f":"step!B301","v":1160},null,null,null,null,null,null,"Hidden to customers"]
[null,{"$f":"step!B302","v":1165},null,null,null,null,null,null,"Hidden to customers"]
[null,{"$f":"step!B303","v":1170},null,null,null,null,null,null,"Hidden to customers"]
[null,{"$f":"step!B304","v":1175},null,null,null,null,null,null,"Hidden to customers"]
[null,{"$f":"step!B305","v":1180},null,null,null,null,null,null,"Hidden to customers"]
[null,{"$f":"step!B306","v":1185},null,null,null,null,null,null,"Hidden to customers"]
[null,{"$f":"step!B307","v":1190},null,null,null,null,null,null,"Hidden to customers"]
[null,{"$f":"step!B308","v":1195},null,null,null,null,null,null,"Hidden to customers"]
[null,{"$f":"step!B309","v":1200},null,null,null,null,null,null,"Hidden to customers"]
[null,{"$f":"step!B310","v":1205},null,null,null,null,null,null,"Hidden to customers"]
[null,{"$f":"step!B311","v":1210},null,null,null,null,null,null,"Hidden to customers"]
[null,{"$f":"step!B312","v":1215},null,null,null,null,null,null,"Hidden to customers"]
[null,{"$f":"step!B313","v":1220},null,null,null,null,null,null,"Hidden to customers"]
[null,{"$f":"step!B314","v":1225},null,null,null,null,null,null,"Hidden to customers"]
[null,{"$f":"step!B315","v":1230},null,null,null,null,null,null,"Hidden to customers"]
[null,{"$f":"step!B316","v":1235},null,null,null,null,null,null,"Hidden to customers"]
[null,{"$f":"step!B317","v":1240},null,null,null,null,null,null,"Hidden to customers"]
[null,{"$f":"step!B318","v":1245},null,null,null,null,null,null,"Hidden to customers"]
[null,{"$f":"step!B319","v":1250},null,null,null,null,null,null,"Hidden to customers"]
[null,{"$f":"step!B320","v":1255},null,null,null,null,null,null,"Hidden to customers"]
[null,{"$f":"step!B321","v":1260},null,null,null,null,null,null,"Hidden to customers"]
[null,{"$f":"step!B322","v":1265},null,null,null,null,null,null,"Hidden to customers"]
[null,{"$f":"step!B323","v":1270},null,null,null,null,null,null,"Hidden to customers"]
[null,{"$f":"step!B324","v":1275},null,null,null,null,null,null,"Hidden to customers"]
[null,{"$f":"step!B325","v":1280},null,null,null,null,null,null,"Hidden to customers"]
[null,{"$f":"step!B326","v":1285},null,null,null,null,null,null,"Hidden to customers"]
[null,{"$f":"step!B327","v":1290},null,null,null,null,null,null,"Hidden to customers"]
[null,{"$f":"step!B328","v":1295},null,null,null,null,null,null,"Hidden to customers"]
[null,{"$f":"step!B329","v":1300},null,null,null,null,null,null,"Hidden to customers"]
[null,{"$f":"step!B330","v":1305},null,null,null,null,null,null,"Hidden to customers"]
[null,{"$f":"step!B331","v":1310},null,null,null,null,null,null,"Hidden to customers"]
[null,{"$f":"step!B332","v":1315},null,null,null,null,null,null,"Hidden to customers"]
[null,{"$f":"step!B333","v":1320},null,null,null,null,null,null,"Hidden to customers"]
[null,{"$f":"step!B334","v":1325},null,null,null,null,null,null,"Hidden to customers"]
[null,{"$f":"step!B335","v":1330},null,null,null,null,null,null,"Hidden to customers"]
[null,{"$f":"step!B336","v":1335},null,null,null,null,null,null,"Hidden to customers"]
[null,{"$f":"step!B337","v":1340},null,null,null,null,null,null,"Hidden to customers"]
[null,{"$f":"step!B338","v":1345},null,null,null,null,null,null,"Hidden to customers"]
[null,{"$f":"step!B339","v":1350},null,null,null,null,null,null,"Hidden to customers"]
[null,{"$f":"step!B340","v":1355},null,null,null,null,null,null,"Hidden to customers"]
[null,{"$f":"step!B341","v":1360},null,null,null,null,null,null,"Hidden to customers"]
[null,{"$f":"step!B342","v":1365},null,null,null,null,null,null,"Hidden to customers"]
[null,{"$f":"step!B343","v":1370},null,null,null,null,null,null,"Hidden to customers"]
[null,{"$f":"step!B344","v":1375},null,null,null,null,null,null,"Hidden to customers"]
[null,{"$f":"step!B345","v":1380},null,null,null,null,null,null,"Hidden to customers"]
[null,{"$f":"step!B346","v":1385},null,null,null,null,null,null,"Hidden to customers"]
[null,{"$f":"step!B347","v":1390},null,null,null,null,null,null,"Hidden to customers"]
[null,{"$f":"step!B348","v":1395},null,null,null,null,null,null,"Hidden to customers"]
[null,{"$f":"step!B349","v":1400},null,null,null,null,null,null,"Hidden to customers"]
[null,{"$f":"step!B350","v":1405},null,null,null,null,null,null,"Hidden to customers"]
[null,{"$f":"step!B351","v":1410},null,null,null,null,null,null,"Hidden to customers"]
[null,{"$f":"step!B352","v":1415},null,null,null,null,null,null,"Hidden to customers"]
[null,{"$f":"step!B353","v":1420},null,null,null,null,null,null,"Hidden to customers"]
[null,{"$f":"step!B354","v":1425},null,null,null,null,null,null,"Hidden to customers"]
[null,{"$f":"step!B355","v":1430},null,null,null,null,null,null,"Hidden to customers"]
[null,{"$f":"step!B356","v":1435},null,null,null,null,null,null,"Hidden to customers"]
[null,{"$f":"step!B357","v":1440},null,null,null,null,null,null,"Hidden to customers"]
[null,{"$f":"step!B358","v":1445},null,null,null,null,null,null,"Hidden to customers"]
[null,{"$f":"step!B359","v":1450},null,null,null,null,null,null,"Hidden to customers"]
[null,{"$f":"step!B360","v":1455},null,null,null,null,null,null,"Hidden to customers"]
[null,{"$f":"step!B361","v":1460},null,null,null,null,null,null,"Hidden to customers"]
[null,{"$f":"step!B362","v":1465},null,null,null,null,null,null,"Hidden to customers"]
[null,{"$f":"step!B363","v":1470},null,null,null,null,null,null,"Hidden to customers"]
[null,{"$f":"step!B364","v":1475},null,null,null,null,null,null,"Hidden to customers"]
[null,{"$f":"step!B365","v":1480},null,null,null,null,null,null,"Hidden to customers"]
[null,{"$f":"step!B366","v":1485},null,null,null,null,null,null,"Hidden to customers"]
[null,{"$f":"step!B367","v":1490},null,null,null,null,null,null,"Hidden to customers"]
[null,{"$f":"step!B368","v":1495},null,null,null,null,null,null,"Hidden to customers"]
[null,{"$f":"step!B369","v":1500},null,null,null,null,null,null,"Hidden to customers"]

{"sheet":"MIPI RX","index":1,"n_rows":35,"n_cols":9,"rows_kept":35,"cut":false,"hidden":false,"merged":[[0,0,0,1],[0,2,0,3],[0,4,0,5]]}
[null,null,"MIPI Receiver Utility"]
[null,"Enter the video information",null,null,null,"Input fields"]
[null,"Data type","RAW10"]
[null,"# of data pixels per line",1920]
[null,"Pixel clock frequency (MHz)",60]
[]
[null,"Enter the MIPI interface details"]
[null,"Data rate (Mbps)",1500]
[null,"# of data lanes",4]
[null,"Clock mode","Continuous"]
[null,"Line rate (kHz)",100,{"$f":"IF(OR(C3='Data Type'!B15,C3='Data Type'!B16),\"Enter line-rate of even lines\",\"\")","v":""}]
[null,"Camera's THS-TRAIL delay (ns)",70]
[null,"Camera's TCLK-POST delay (ns)",300,"For Non-continuous Clock Mode only"]
[null,"Camera's THS-EXIT delay (ns)",100]
[]
[null,"YUV 420?",{"$f":"OR(C3='Data Type'!B15,C3='Data Type'!B16)","v":false},null,null,null,null,null,"Hidden to customers"]
[null,"YUV?",{"$f":"OR(C3='Data Type'!B15,C3='Data Type'!B16,C3='Data Type'!B17,C3='Data Type'!B18,C3='Data Type'!B19)","v":false},null,null,null,null,null,"Hidden to customers"]
[null,"Maximum # of pixels per line",{"$f":"VLOOKUP($C$3,'Data Type'!B3:I19,8)","v":4608},null,null,null,null,null,"Hidden to customers"]
[null,{"$f":"IF(C16,\"# of pixels per pixel clock (even lines)\",\"# of pixels per pixel clock\")","v":"# of pixels per pixel clock"},{"$f":"VLOOKUP($C$3,'Data Type'!B3:H19,7)","v":4},{"$f":"IF(C17,\"(on average)\",\"\")","v":""},null,null,null,null,"Hidden to customers"]
[]
[null,"THS-TRAIL (ns)",{"$f":"IF(C9=1,48/C8*1000,IF(C9=2,72/C8*1000,80/C8*1000))","v":53.333333333333336},null,null,null,null,null,"Hidden to customers"]
[null,"Minimum THS-TRAIL (ns)",{"$f":"MAX(C21,65)","v":65}]
[null,"Minimum THS-TRAIL+TCLK-POST (ns)",{"$f":"IF(C10=\"Continuous\",\"n/a\",IF(C9=1,750/C8*1000,IF(C9=2,450/C8*1000,260/C8*1000)))","v":"n/a"}]
[null,"Minimum THS-EXIT (ns)",{"$f":"MAX(72/C8*1000,100)","v":100}]
[]
[null,"Minimum RX pixel clock frequency (MHz)",{"$f":"120%*C4*C11/C19/1000","v":57.6}]
[]
[null,"Results"]
[null,"Maximum line buffer test",{"$f":"IF(C4>C18,\"Action Required\",\"PASS\")","v":"PASS"},{"$f":"IF(C29<>\"PASS\",\"Try tuning the camera's register settings to a) decreasing the number of pixels per line, or b) selecting a different data type.\",\"\")","v":""}]
[null,"Minimum RX pixel clock frequency test",{"$f":"IF(C26>C5,\"Action Required\",\"PASS\")","v":"PASS"},{"$f":"IF(C30<>\"PASS\",\"Try a) increasing the pixel clock frequency, or tuning the camera's register settings to b) decreasing the number of pixels per line, or c) decreasing the line rate.\",\"\")","v":""}]
[null,"Minimum THS-EXIT test",{"$f":"IF(C24>C14,\"Action Required\",\"PASS\")","v":"PASS"},{"$f":"IF(C31<>\"PASS\",\"Try tuning the camera's register settings to a) increase THS-EXIT delay, or b) increase the data rate.\",\"\")","v":""}]
[null,"Minimum THS-TRAIL test",{"$f":"IF(C22>C12,\"Action Required\",\"PASS\")","v":"PASS"},{"$f":"IF(C32<>\"PASS\",\"Try tuning the camera's register settings to a) increase THS-TRAIL delay, or b) increase the data rate.\",\"\")","v":""}]
[null,"Minimum THS-TRAIL+TCLK-POST test",{"$f":"IF(C10=\"Non-continuous\",IF(C23>C12+C13,\"Action Required\",\"PASS\"),\"n/a\")","v":"n/a"},{"$f":"IF(C33=\"Action Required\",\"Try tuning the camera's register settings to a) increase THS-TRAIL delay, or a) increase TCLK-POST delay, or c) increase the data rate, or d) increase the number of data lanes, or e) use Continuous Clock Mode.\",\"\")","v":""}]
[]
["© Efinix, Inc."]

{"sheet":"DYNAMIC HRES GEN","index":2,"n_rows":14,"n_cols":20,"rows_kept":14,"cut":false,"hidden":false,"merged":[[5,19,6,20],[11,15,11,24],[12,15,12,24],[13,15,14,24]]}
[null,null,{"$f":"'MIPI TX'!C41","v":56.971219512195134},null,{"$f":"MAX(I3,H3)-F1","v":5},{"$f":"'MIPI TX'!C4/'MIPI TX'!C9/'MIPI TX'!C34","v":3.1999999999999997},"PHY DELAY",{"$f":"'MIPI TX'!C52+'MIPI TX'!C54+100","v":1586}]
[1500,"HRES","Active L","Blank L","FPS(Hz)","P CLK(MHz)","V Blank(us)","Max. H Total(us)","W Dummy HS\nMin. H Total(us)","HBP","HFP","HS Pulse","HBP","HFP","HS Pulse"]
[{"$f":"'MIPI TX'!C3","v":"RAW10"},{"$f":"'MIPI TX'!C4","v":1920},{"$f":"'MIPI TX'!C5","v":1080},{"$f":"'MIPI TX'!C6","v":3},{"$f":"'MIPI TX'!C7","v":60},{"$f":"'MIPI TX'!C9","v":100},{"$f":"'MIPI TX'!E6","v":24.599999999999998},{"$f":"'MIPI TX'!C42","v":8.1999999999999993},{"$f":"('MIPI TX'!E42)/1000","v":5.4867999999999997},{"$f":"'W Dummy'!M49","v":231},{"$f":"'W Dummy'!N49","v":116},{"$f":"'W Dummy'!O49","v":39},{"$f":"'W Dummy'!M23","v":165},{"$f":"'W Dummy'!N23","v":83},{"$f":"'W Dummy'!O23","v":28}]
[]
[{"$f":"A2/1000 & \"GHz\"","v":"1.5GHz"},"HRES","Max. Active Line","Blank Line","FPS(Hz)","P CLK(MHz)","V Blank(us)","Max. H Total(us)","Min. H Total(us)","Min. HBP","Min. HFP","Min. HS Pulse","HBP","HFP","HS Pulse"]
["RAW10",32,1516,3,600,100,3.2889999999999997,1.0963333333333332,1.0551199999999998,61,31,11,60,30,10,null,null,null,null,{"$f":"IF(('MIPI TX'!C70=\"PASS\")*AND('MIPI TX'!C71=\"PASS\")*AND('MIPI TX'!C72=\"PASS\")*AND('MIPI TX'!C73=\"PASS\"),\"READY TO GEN\",\"NOT READY\")","v":"READY TO GEN"}]
["RAW10",64,1426,3,600,100,3.4969999999999999,1.1656666666666666,1.11144,63,32,11,60,30,10]
["RAW10",1664,420,3,600,100,11.797000000000001,3.9323333333333332,3.9274400000000003,151,76,26,96,48,16]
["RAW10",1920,376,3,600,100,13.160999999999998,4.3869999999999996,4.3780000000000001,165,83,28,102,51,17]
[]
[null,null,null,null,null,null,null,null,null,null,null,null,null,null,null,"Tips:"]
[null,null,null,null,null,null,null,null,null,null,null,null,null,null,null,"1. Input Tx information for one of the resolutions you want to use into the MIPI TX worksheet until it passes. This sheet should display \"READY TO GEN” when it passes."]
[null,null,null,null,null,null,null,null,null,null,null,null,null,null,null,"2. Use this sheet, DYNAMIC HRES GEN, to enter all the resolutions you want to use in the HRES column."]
[null,null,null,null,null,null,null,null,null,null,null,null,null,null,null,"3. Click the “Generate Porch and Max. # of Lines” button. The utility generates the required maximum and minimum porch values for each resolution."]

{"sheet":"step","index":3,"n_rows":369,"n_cols":6,"rows_kept":369,"cut":false,"hidden":true,"merged":[]}
[null,null,"Period of tx__m_txclkesc (ns)",50]
[]
[]
["OUTCLKSEL","Bit Rate (Mbps)","OSC_CAL_CLK (MHz)","UI (ns)",null,"Step (ns)"]
[0,{"$f":"IF(A5<64,(80*1*1000)+(5*1000/4)*(A5-0),(IF(A5<128,(80*2*1000)+(5*1000/2)*(A5-64),(80*4*1000)+(5*1000/1)*(A5-128))))/1000","v":80},{"$f":"IF(A5<37,B5*4/4,(IF(A5<64,B5*4/6,IF(A5<101,B5*2/4,IF(A5<128,B5*2/6,IF(A5<165,B5*1/4,IF(A5<215,B5*1/6,IF(A5<215,B5*1/6,IF(A5<265,B5*1/8,IF(A5<315,B5*1/10,B5*1/12))))))))))","v":80},{"$f":"1000/B5","v":12.5},{"$f":"B5/C5","v":1},{"$f":"1/C5*1000","v":12.5}]
[1,{"$f":"IF(A6<64,(80*1*1000)+(5*1000/4)*(A6-0),(IF(A6<128,(80*2*1000)+(5*1000/2)*(A6-64),(80*4*1000)+(5*1000/1)*(A6-128))))/1000","v":81.25},81.25,{"$f":"1000/B6","v":12.307692307692308},{"$f":"B6/C6","v":1},12.307692307692308]
[2,82.5,82.5,12.121212121212121,1,12.121212121212121]
[3,83.75,83.75,11.940298507462687,1,11.940298507462687]
[4,85,85,11.764705882352942,1,11.76470588235294]
[5,86.25,86.25,11.594202898550725,1,11.594202898550725]
[6,87.5,87.5,11.428571428571429,1,11.428571428571429]
[7,88.75,88.75,11.267605633802816,1,11.267605633802818]
[8,90,90,11.111111111111111,1,11.111111111111111]
[9,91.25,91.25,10.95890410958904,1,10.95890410958904]
[10,92.5,92.5,10.810810810810811,1,10.810810810810811]
[11,93.75,93.75,10.666666666666666,1,10.666666666666666]
[12,95,95,10.526315789473685,1,10.526315789473683]
[13,96.25,96.25,10.38961038961039,1,10.38961038961039]
[14,97.5,97.5,10.256410256410257,1,10.256410256410257]
[15,98.75,98.75,10.126582278481013,1,10.126582278481013]
[16,100,100,10,1,10]
[17,101.25,101.25,9.8765432098765427,1,9.8765432098765427]
[18,102.5,102.5,9.7560975609756095,1,9.7560975609756095]
[19,103.75,103.75,9.6385542168674707,1,9.6385542168674707]
[20,105,105,9.5238095238095237,1,9.5238095238095255]
[21,106.25,106.25,9.4117647058823533,1,9.4117647058823515]
[22,107.5,107.5,9.3023255813953494,1,9.3023255813953494]
[23,108.75,108.75,9.1954022988505741,1,9.1954022988505741]
[24,110,110,9.0909090909090917,1,9.0909090909090899]
[25,111.25,111.25,8.9887640449438209,1,8.9887640449438209]
[26,112.5,112.5,8.8888888888888893,1,8.8888888888888893]
[27,113.75,113.75,8.791208791208792,1,8.791208791208792]
[28,115,115,8.695652173913043,1,8.695652173913043]
[29,116.25,116.25,8.6021505376344081,1,8.6021505376344081]
[30,117.5,117.5,8.5106382978723403,1,8.5106382978723403]
[31,118.75,118.75,8.4210526315789469,1,8.4210526315789469]
[32,120,120,8.3333333333333339,1,8.3333333333333339]
[33,121.25,121.25,8.2474226804123703,1,8.247422680412372]
[34,122.5,122.5,8.1632653061224492,1,8.1632653061224492]
[35,123.75,123.75,8.0808080808080813,1,8.0808080808080813]
[36,125,125,8,1,8]
[37,126.25,84.166666666666671,7.9207920792079207,1.5,11.881188118811881]
[38,127.5,85,7.8431372549019605,1.5,11.76470588235294]
[39,128.75,85.833333333333329,7.766990291262136,1.5,11.650485436893204]
[40,130,86.666666666666671,7.6923076923076925,1.5,11.538461538461537]
[41,131.25,87.5,7.6190476190476186,1.5,11.428571428571429]
[42,132.5,88.333333333333329,7.5471698113207548,1.5,11.320754716981133]
[43,133.75,89.166666666666671,7.4766355140186915,1.5,11.214953271028037]
[44,135,90,7.4074074074074074,1.5,11.111111111111111]
[45,136.25,90.833333333333329,7.3394495412844041,1.5,11.009174311926607]
[46,137.5,91.666666666666671,7.2727272727272725,1.5,10.909090909090908]
[47,138.75,92.5,7.2072072072072073,1.5,10.810810810810811]
[48,140,93.333333333333329,7.1428571428571432,1.5,10.714285714285714]
[49,141.25,94.166666666666671,7.0796460176991154,1.5,10.619469026548673]
[50,142.5,95,7.0175438596491224,1.5,10.526315789473683]
[51,143.75,95.833333333333329,6.9565217391304346,1.5,10.434782608695652]
[52,145,96.666666666666671,6.8965517241379306,1.5,10.344827586206897]
[53,146.25,97.5,6.8376068376068373,1.5,10.256410256410257]
[54,147.5,98.333333333333329,6.7796610169491522,1.5,10.16949152542373]
[55,148.75,99.166666666666671,6.7226890756302522,1.5,10.084033613445378]
[56,150,100,6.666666666666667,1.5,10]
[57,151.25,100.83333333333333,6.6115702479338845,1.5,9.9173553719008272]
[58,152.5,101.66666666666667,6.557377049180328,1.5,9.8360655737704903]
[59,153.75,102.5,6.5040650406504064,1.5,9.7560975609756095]
[60,155,103.33333333333333,6.4516129032258061,1.5,9.67741935483871]
[61,156.25,104.16666666666667,6.4,1.5,9.6]
[62,157.5,105,6.3492063492063489,1.5,9.5238095238095255]
[63,158.75,105.83333333333333,6.2992125984251972,1.5,9.4488188976377945]
[64,160,{"$f":"IF(A69<37,B69*4/4,(IF(A69<64,B69*4/6,IF(A69<101,B69*2/4,IF(A69<128,B69*2/6,IF(A69<165,B69*1/4,IF(A69<215,B69*1/6,IF(A69<215,B69*1/6,IF(A69<265,B69*1/8,IF(A69<315,B69*1/10,B69*1/12))))))))))","v":80},6.25,2,{"$f":"1/C69*1000","v":12.5}]
[65,{"$f":"IF(A70<64,(80*1*1000)+(5*1000/4)*(A70-0),(IF(A70<128,(80*2*1000)+(5*1000/2)*(A70-64),(80*4*1000)+(5*1000/1)*(A70-128))))/1000","v":162.5},81.25,{"$f":"1000/B70","v":6.1538461538461542},{"$f":"B70/C70","v":2},12.307692307692308]
[66,165,82.5,6.0606060606060606,2,12.121212121212121]
[67,167.5,83.75,5.9701492537313436,2,11.940298507462687]
[68,170,85,5.882352941176471,2,11.76470588235294]
[69,172.5,86.25,5.7971014492753623,2,11.594202898550725]
[70,175,87.5,5.7142857142857144,2,11.428571428571429]
[71,177.5,88.75,5.6338028169014081,2,11.267605633802818]
[72,180,90,5.5555555555555554,2,11.111111111111111]
[73,182.5,91.25,5.4794520547945202,2,10.95890410958904]
[74,185,92.5,5.4054054054054053,2,10.810810810810811]
[75,187.5,93.75,5.333333333333333,2,10.666666666666666]
[76,190,95,5.2631578947368425,2,10.526315789473683]
[77,192.5,96.25,5.1948051948051948,2,10.38961038961039]
[78,195,97.5,5.1282051282051286,2,10.256410256410257]
[79,197.5,98.75,5.0632911392405067,2,10.126582278481013]
[80,200,100,5,2,10]
[81,202.5,101.25,4.9382716049382713,2,9.8765432098765427]
[82,205,102.5,4.8780487804878048,2,9.7560975609756095]
[83,207.5,103.75,4.8192771084337354,2,9.6385542168674707]
[84,210,105,4.7619047619047619,2,9.5238095238095255]
[85,212.5,106.25,4.7058823529411766,2,9.4117647058823515]
[86,215,107.5,4.6511627906976747,2,9.3023255813953494]
[87,217.5,108.75,4.5977011494252871,2,9.1954022988505741]
[88,220,110,4.5454545454545459,2,9.0909090909090899]
[89,222.5,111.25,4.4943820224719104,2,8.9887640449438209]
[90,225,112.5,4.4444444444444446,2,8.8888888888888893]
[91,227.5,113.75,4.395604395604396,2,8.791208791208792]
[92,230,115,4.3478260869565215,2,8.695652173913043]
[93,232.5,116.25,4.301075268817204,2,8.6021505376344081]
[94,235,117.5,4.2553191489361701,2,8.5106382978723403]
[95,237.5,118.75,4.2105263157894735,2,8.4210526315789469]
[96,240,120,4.166666666666667,2,8.3333333333333339]
[97,242.5,121.25,4.1237113402061851,2,8.247422680412372]
[98,245,122.5,4.0816326530612246,2,8.1632653061224492]
[99,247.5,123.75,4.0404040404040407,2,8.0808080808080813]
[100,250,125,4,2,8]
[101,252.5,84.166666666666671,3.9603960396039604,3,11.881188118811881]
[102,255,85,3.9215686274509802,3,11.76470588235294]
[103,257.5,85.833333333333329,3.883495145631068,3,11.650485436893204]
[104,260,86.666666666666671,3.8461538461538463,3,11.538461538461537]
[105,262.5,87.5,3.8095238095238093,3,11.428571428571429]
[106,265,88.333333333333329,3.7735849056603774,3,11.320754716981133]
[107,267.5,89.166666666666671,3.7383177570093458,3,11.214953271028037]
[108,270,90,3.7037037037037037,3,11.111111111111111]
[109,272.5,90.833333333333329,3.669724770642202,3,11.009174311926607]
[110,275,91.666666666666671,3.6363636363636362,3,10.909090909090908]
[111,277.5,92.5,3.6036036036036037,3,10.810810810810811]
[112,280,93.333333333333329,3.5714285714285716,3,10.714285714285714]
[113,282.5,94.166666666666671,3.5398230088495577,3,10.619469026548673]
[114,285,95,3.5087719298245612,3,10.526315789473683]
[115,287.5,95.833333333333329,3.4782608695652173,3,10.434782608695652]
[116,290,96.666666666666671,3.4482758620689653,3,10.344827586206897]
[117,292.5,97.5,3.4188034188034186,3,10.256410256410257]
[118,295,98.333333333333329,3.3898305084745761,3,10.16949152542373]
[119,297.5,99.166666666666671,3.3613445378151261,3,10.084033613445378]
[120,300,100,3.3333333333333335,3,10]
[121,302.5,100.83333333333333,3.3057851239669422,3,9.9173553719008272]
[122,305,101.66666666666667,3.278688524590164,3,9.8360655737704903]
[123,307.5,102.5,3.2520325203252032,3,9.7560975609756095]
[124,310,103.33333333333333,3.225806451612903,3,9.67741935483871]
[125,312.5,104.16666666666667,3.2,3,9.6]
[126,315,105,3.1746031746031744,3,9.5238095238095255]
[127,317.5,105.83333333333333,3.1496062992125986,3,9.4488188976377945]
[128,320,{"$f":"IF(A133<37,B133*4/4,(IF(A133<64,B133*4/6,IF(A133<101,B133*2/4,IF(A133<128,B133*2/6,IF(A133<165,B133*1/4,IF(A133<215,B133*1/6,IF(A133<215,B133*1/6,IF(A133<265,B133*1/8,IF(A133<315,B133*1/10,B133*1/12))))))))))","v":80},3.125,4,{"$f":"1/C133*1000","v":12.5}]
[129,{"$f":"IF(A134<64,(80*1*1000)+(5*1000/4)*(A134-0),(IF(A134<128,(80*2*1000)+(5*1000/2)*(A134-64),(80*4*1000)+(5*1000/1)*(A134-128))))/1000","v":325},81.25,{"$f":"1000/B134","v":3.0769230769230771},{"$f":"B134/C134","v":4},12.307692307692308]
[130,330,82.5,3.0303030303030303,4,12.121212121212121]
[131,335,83.75,2.9850746268656718,4,11.940298507462687]
[132,340,85,2.9411764705882355,4,11.76470588235294]
[133,345,86.25,2.8985507246376812,4,11.594202898550725]
[134,350,87.5,2.8571428571428572,4,11.428571428571429]
[135,355,88.75,2.816901408450704,4,11.267605633802818]
[136,360,90,2.7777777777777777,4,11.111111111111111]
[137,365,91.25,2.7397260273972601,4,10.95890410958904]
[138,370,92.5,2.7027027027027026,4,10.810810810810811]
[139,375,93.75,2.6666666666666665,4,10.666666666666666]
[140,380,95,2.6315789473684212,4,10.526315789473683]
[141,385,96.25,2.5974025974025974,4,10.38961038961039]
[142,390,97.5,2.5641025641025643,4,10.256410256410257]
[143,395,98.75,2.5316455696202533,4,10.126582278481013]
[144,400,100,2.5,4,10]
[145,405,101.25,2.4691358024691357,4,9.8765432098765427]
[146,410,102.5,2.4390243902439024,4,9.7560975609756095]
[147,415,103.75,2.4096385542168677,4,9.6385542168674707]
[148,420,105,2.3809523809523809,4,9.5238095238095255]
[149,425,106.25,2.3529411764705883,4,9.4117647058823515]
[150,430,107.5,2.3255813953488373,4,9.3023255813953494]
[151,435,108.75,2.2988505747126435,4,9.1954022988505741]
[152,440,110,2.2727272727272729,4,9.0909090909090899]
[153,445,111.25,2.2471910112359552,4,8.9887640449438209]
[154,450,112.5,2.2222222222222223,4,8.8888888888888893]
[155,455,113.75,2.197802197802198,4,8.791208791208792]
[156,460,115,2.1739130434782608,4,8.695652173913043]
[157,465,116.25,2.150537634408602,4,8.6021505376344081]
[158,470,117.5,2.1276595744680851,4,8.5106382978723403]
[159,475,118.75,2.1052631578947367,4,8.4210526315789469]
[160,480,120,2.0833333333333335,4,8.3333333333333339]
[161,485,121.25,2.0618556701030926,4,8.247422680412372]
[162,490,122.5,2.0408163265306123,4,8.1632653061224492]
[163,495,123.75,2.0202020202020203,4,8.0808080808080813]
[164,500,125,2,4,8]
[165,505,84.166666666666671,1.9801980198019802,6,11.881188118811881]
[166,510,85,1.9607843137254901,6,11.76470588235294]
[167,515,85.833333333333329,1.941747572815534,6,11.650485436893204]
[168,520,86.666666666666671,1.9230769230769231,6,11.538461538461537]
[169,525,87.5,1.9047619047619047,6,11.428571428571429]
[170,530,88.333333333333329,1.8867924528301887,6,11.320754716981133]
[171,535,89.166666666666671,1.8691588785046729,6,11.214953271028037]
[172,540,90,1.8518518518518519,6,11.111111111111111]
[173,545,90.833333333333329,1.834862385321101,6,11.009174311926607]
[174,550,91.666666666666671,1.8181818181818181,6,10.909090909090908]
[175,555,92.5,1.8018018018018018,6,10.810810810810811]
[176,560,93.333333333333329,1.7857142857142858,6,10.714285714285714]
[177,565,94.166666666666671,1.7699115044247788,6,10.619469026548673]
[178,570,95,1.7543859649122806,6,10.526315789473683]
[179,575,95.833333333333329,1.7391304347826086,6,10.434782608695652]
[180,580,96.666666666666671,1.7241379310344827,6,10.344827586206897]
[181,585,97.5,1.7094017094017093,6,10.256410256410257]
[182,590,98.333333333333329,1.6949152542372881,6,10.16949152542373]
[183,595,99.166666666666671,1.680672268907563,6,10.084033613445378]
[184,600,100,1.6666666666666667,6,10]
[185,605,100.83333333333333,1.6528925619834711,6,9.9173553719008272]
[186,610,101.66666666666667,1.639344262295082,6,9.8360655737704903]
[187,615,102.5,1.6260162601626016,6,9.7560975609756095]
[188,620,103.33333333333333,1.6129032258064515,6,9.67741935483871]
[189,625,104.16666666666667,1.6,6,9.6]
[190,630,105,1.5873015873015872,6,9.5238095238095255]
[191,635,105.83333333333333,1.5748031496062993,6,9.4488188976377945]
[192,640,{"$f":"IF(A197<37,B197*4/4,(IF(A197<64,B197*4/6,IF(A197<101,B197*2/4,IF(A197<128,B197*2/6,IF(A197<165,B197*1/4,IF(A197<215,B197*1/6,IF(A197<215,B197*1/6,IF(A197<265,B197*1/8,IF(A197<315,B197*1/10,B197*1/12))))))))))","v":106.66666666666667},1.5625,6,{"$f":"1/C197*1000","v":9.375}]
[193,{"$f":"IF(A198<64,(80*1*1000)+(5*1000/4)*(A198-0),(IF(A198<128,(80*2*1000)+(5*1000/2)*(A198-64),(80*4*1000)+(5*1000/1)*(A198-128))))/1000","v":645},107.5,{"$f":"1000/B198","v":1.5503875968992249},{"$f":"B198/C198","v":6},9.3023255813953494]
[194,650,108.33333333333333,1.5384615384615385,6,9.2307692307692317]
[195,655,109.16666666666667,1.5267175572519085,6,9.1603053435114514]
[196,660,110,1.5151515151515151,6,9.0909090909090899]
[197,665,110.83333333333333,1.5037593984962405,6,9.022556390977444]
[198,670,111.66666666666667,1.4925373134328359,6,8.9552238805970141]
[199,675,112.5,1.4814814814814814,6,8.8888888888888893]
[200,680,113.33333333333333,1.4705882352941178,6,8.8235294117647065]
[201,685,114.16666666666667,1.4598540145985401,6,8.7591240875912391]
[202,690,115,1.4492753623188406,6,8.695652173913043]
[203,695,115.83333333333333,1.4388489208633093,6,8.6330935251798557]
[204,700,116.66666666666667,1.4285714285714286,6,8.5714285714285712]
[205,705,117.5,1.4184397163120568,6,8.5106382978723403]
[206,710,118.33333333333333,1.408450704225352,6,8.4507042253521139]
[207,715,119.16666666666667,1.3986013986013985,6,8.3916083916083917]
[208,720,120,1.3888888888888888,6,8.3333333333333339]
[209,725,120.83333333333333,1.3793103448275863,6,8.2758620689655178]
[210,730,121.66666666666667,1.3698630136986301,6,8.2191780821917799]
[211,735,122.5,1.3605442176870748,6,8.1632653061224492]
[212,740,123.33333333333333,1.3513513513513513,6,8.1081081081081088]
[213,745,124.16666666666667,1.3422818791946309,6,8.0536912751677843]
[214,750,125,1.3333333333333333,6,8]
[215,755,94.375,1.3245033112582782,8,10.596026490066226]
[216,760,95,1.3157894736842106,8,10.526315789473683]
[217,765,95.625,1.3071895424836601,8,10.457516339869281]
[218,770,96.25,1.2987012987012987,8,10.38961038961039]
[219,775,96.875,1.2903225806451613,8,10.32258064516129]
[220,780,97.5,1.2820512820512822,8,10.256410256410257]
[221,785,98.125,1.2738853503184713,8,10.19108280254777]
[222,790,98.75,1.2658227848101267,8,10.126582278481013]
[223,795,99.375,1.2578616352201257,8,10.062893081761006]
[224,800,100,1.25,8,10]
[225,805,100.625,1.2422360248447204,8,9.937888198757765]
[226,810,101.25,1.2345679012345678,8,9.8765432098765427]
[227,815,101.875,1.2269938650306749,8,9.8159509202453989]
[228,820,102.5,1.2195121951219512,8,9.7560975609756095]
[229,825,103.125,1.2121212121212122,8,9.6969696969696972]
[230,830,103.75,1.2048192771084338,8,9.6385542168674707]
[231,835,104.375,1.1976047904191616,8,9.5808383233532926]
[232,840,105,1.1904761904761905,8,9.5238095238095255]
[233,845,105.625,1.1834319526627219,8,9.4674556213017755]
[234,850,106.25,1.1764705882352942,8,9.4117647058823515]
[235,855,106.875,1.1695906432748537,8,9.3567251461988299]
[236,860,107.5,1.1627906976744187,8,9.3023255813953494]
[237,865,108.125,1.1560693641618498,8,9.2485549132947984]
[238,870,108.75,1.1494252873563218,8,9.1954022988505741]
[239,875,109.375,1.1428571428571428,8,9.1428571428571441]
[240,880,110,1.1363636363636365,8,9.0909090909090899]
[241,885,110.625,1.1299435028248588,8,9.0395480225988702]
[242,890,111.25,1.1235955056179776,8,8.9887640449438209]
[243,895,111.875,1.1173184357541899,8,8.938547486033519]
[244,900,112.5,1.1111111111111112,8,8.8888888888888893]
[245,905,113.125,1.1049723756906078,8,8.8397790055248624]
[246,910,113.75,1.098901098901099,8,8.791208791208792]
[247,915,114.375,1.0928961748633881,8,8.7431693989071047]
[248,920,115,1.0869565217391304,8,8.695652173913043]
[249,925,115.625,1.0810810810810811,8,8.6486486486486491]
[250,930,116.25,1.075268817204301,8,8.6021505376344081]
[251,935,116.875,1.0695187165775402,8,8.5561497326203213]
[252,940,117.5,1.0638297872340425,8,8.5106382978723403]
[253,945,118.125,1.0582010582010581,8,8.4656084656084669]
[254,950,118.75,1.0526315789473684,8,8.4210526315789469]
[255,955,119.375,1.0471204188481675,8,8.376963350785342]
[256,960,{"$f":"IF(A261<37,B261*4/4,(IF(A261<64,B261*4/6,IF(A261<101,B261*2/4,IF(A261<128,B261*2/6,IF(A261<165,B261*1/4,IF(A261<215,B261*1/6,IF(A261<215,B261*1/6,IF(A261<265,B261*1/8,IF(A261<315,B261*1/10,B261*1/12))))))))))","v":120},1.0416666666666667,8,{"$f":"1/C261*1000","v":8.3333333333333339}]
[257,{"$f":"IF(A262<64,(80*1*1000)+(5*1000/4)*(A262-0),(IF(A262<128,(80*2*1000)+(5*1000/2)*(A262-64),(80*4*1000)+(5*1000/1)*(A262-128))))/1000","v":965},120.625,{"$f":"1000/B262","v":1.0362694300518134},{"$f":"B262/C262","v":8},8.290155440414507]
[258,970,121.25,1.0309278350515463,8,8.247422680412372]
[259,975,121.875,1.0256410256410255,8,8.2051282051282044]
[260,980,122.5,1.0204081632653061,8,8.1632653061224492]
[261,985,123.125,1.015228426395939,8,8.1218274111675139]
[262,990,123.75,1.0101010101010102,8,8.0808080808080813]
[263,995,124.375,1.0050251256281406,8,8.0402010050251267]
[264,1000,125,1,8,8]
[265,1005,100.5,0.99502487562189057,10,9.9502487562189046]
[266,1010,101,0.99009900990099009,10,9.9009900990099009]
[267,1015,101.5,0.98522167487684731,10,9.8522167487684733]
[268,1020,102,0.98039215686274506,10,9.8039215686274517]
[269,1025,102.5,0.97560975609756095,10,9.7560975609756095]
[270,1030,103,0.970873786407767,10,9.7087378640776691]
[271,1035,103.5,0.96618357487922701,10,9.6618357487922708]
[272,1040,104,0.96153846153846156,10,9.6153846153846168]
[273,1045,104.5,0.9569377990430622,10,9.5693779904306222]
[274,1050,105,0.95238095238095233,10,9.5238095238095255]
[275,1055,105.5,0.94786729857819907,10,9.4786729857819907]
[276,1060,106,0.94339622641509435,10,9.4339622641509422]
[277,1065,106.5,0.93896713615023475,10,9.3896713615023479]
[278,1070,107,0.93457943925233644,10,9.3457943925233646]
[279,1075,107.5,0.93023255813953487,10,9.3023255813953494]
[280,1080,108,0.92592592592592593,10,9.2592592592592595]
[281,1085,108.5,0.92165898617511521,10,9.2165898617511512]
[282,1090,109,0.91743119266055051,10,9.1743119266055047]
[283,1095,109.5,0.91324200913242004,10,9.1324200913241995]
[284,1100,110,0.90909090909090906,10,9.0909090909090899]
[285,1105,110.5,0.90497737556561086,10,9.0497737556561102]
[286,1110,111,0.90090090090090091,10,9.0090090090090094]
[287,1115,111.5,0.89686098654708524,10,8.9686098654708513]
[288,1120,112,0.8928571428571429,10,8.9285714285714288]
[289,1125,112.5,0.88888888888888884,10,8.8888888888888893]
[290,1130,113,0.88495575221238942,10,8.8495575221238933]
[291,1135,113.5,0.88105726872246692,10,8.8105726872246706]
[292,1140,114,0.8771929824561403,10,8.7719298245614024]
[293,1145,114.5,0.8733624454148472,10,8.7336244541484707]
[294,1150,115,0.86956521739130432,10,8.695652173913043]
[295,1155,115.5,0.86580086580086579,10,8.6580086580086579]
[296,1160,116,0.86206896551724133,10,8.6206896551724128]
[297,1165,116.5,0.85836909871244638,10,8.5836909871244629]
[298,1170,117,0.85470085470085466,10,8.5470085470085486]
[299,1175,117.5,0.85106382978723405,10,8.5106382978723403]
[300,1180,118,0.84745762711864403,10,8.4745762711864412]
[301,1185,118.5,0.84388185654008441,10,8.4388185654008439]
[302,1190,119,0.84033613445378152,10,8.4033613445378155]
[303,1195,119.5,0.83682008368200833,10,8.3682008368200833]
[304,1200,120,0.83333333333333337,10,8.3333333333333339]
[305,1205,120.5,0.82987551867219922,10,8.2987551867219924]
[306,1210,121,0.82644628099173556,10,8.2644628099173563]
[307,1215,121.5,0.82304526748971196,10,8.2304526748971192]
[308,1220,122,0.81967213114754101,10,8.1967213114754109]
[309,1225,122.5,0.81632653061224492,10,8.1632653061224492]
[310,1230,123,0.81300813008130079,10,8.1300813008130088]
[311,1235,123.5,0.80971659919028338,10,8.097165991902834]
[312,1240,124,0.80645161290322576,10,8.064516129032258]
[313,1245,124.5,0.80321285140562249,10,8.0321285140562235]
[314,1250,125,0.8,10,8]
[315,1255,104.58333333333333,0.79681274900398402,{"$f":"B320/C320","v":12},9.5617529880478092]
[316,1260,105,0.79365079365079361,{"$f":"B321/C321","v":12},9.5238095238095255]
[317,1265,105.41666666666667,0.79051383399209485,12,9.4861660079051369]
[318,1270,105.83333333333333,0.78740157480314965,12,9.4488188976377945]
[319,1275,106.25,0.78431372549019607,12,9.4117647058823515]
[320,1280,{"$f":"IF(A325<37,B325*4/4,(IF(A325<64,B325*4/6,IF(A325<101,B325*2/4,IF(A325<128,B325*2/6,IF(A325<165,B325*1/4,IF(A325<215,B325*1/6,IF(A325<215,B325*1/6,IF(A325<265,B325*1/8,IF(A325<315,B325*1/10,B325*1/12))))))))))","v":106.66666666666667},0.78125,12,{"$f":"1/C325*1000","v":9.375}]
[321,{"$f":"IF(A326<64,(80*1*1000)+(5*1000/4)*(A326-0),(IF(A326<128,(80*2*1000)+(5*1000/2)*(A326-64),(80*4*1000)+(5*1000/1)*(A326-128))))/1000","v":1285},107.08333333333333,{"$f":"1000/B326","v":0.77821011673151752},12,9.3385214007782107]
[322,1290,107.5,0.77519379844961245,12,9.3023255813953494]
[323,1295,107.91666666666667,0.77220077220077221,12,9.2664092664092657]
[324,1300,108.33333333333333,0.76923076923076927,12,9.2307692307692317]
[325,1305,108.75,0.76628352490421459,12,9.1954022988505741]
[326,1310,109.16666666666667,0.76335877862595425,12,9.1603053435114514]
[327,1315,109.58333333333333,0.76045627376425851,12,9.1254752851711025]
[328,1320,110,0.75757575757575757,12,9.0909090909090899]
[329,1325,110.41666666666667,0.75471698113207553,12,9.0566037735849054]
[330,1330,110.83333333333333,0.75187969924812026,12,9.022556390977444]
[331,1335,111.25,0.74906367041198507,12,8.9887640449438209]
[332,1340,111.66666666666667,0.74626865671641796,12,8.9552238805970141]
[333,1345,112.08333333333333,0.74349442379182151,12,8.921933085501859]
[334,1350,112.5,0.7407407407407407,12,8.8888888888888893]
[335,1355,112.91666666666667,0.73800738007380073,12,8.8560885608856079]
[336,1360,113.33333333333333,0.73529411764705888,12,8.8235294117647065]
[337,1365,113.75,0.73260073260073255,12,8.791208791208792]
[338,1370,114.16666666666667,0.72992700729927007,12,8.7591240875912391]
[339,1375,114.58333333333333,0.72727272727272729,12,8.7272727272727284]
[340,1380,115,0.72463768115942029,12,8.695652173913043]
[341,1385,115.41666666666667,0.72202166064981954,12,8.6642599277978345]
[342,1390,115.83333333333333,0.71942446043165464,12,8.6330935251798557]
[343,1395,116.25,0.71684587813620071,12,8.6021505376344081]
[344,1400,116.66666666666667,0.7142857142857143,12,8.5714285714285712]
[345,1405,117.08333333333333,0.71174377224199292,12,8.5409252669039155]
[346,1410,117.5,0.70921985815602839,12,8.5106382978723403]
[347,1415,117.91666666666667,0.70671378091872794,12,8.4805653710247348]
[348,1420,118.33333333333333,0.70422535211267601,12,8.4507042253521139]
[349,1425,118.75,0.70175438596491224,12,8.4210526315789469]
[350,1430,119.16666666666667,0.69930069930069927,12,8.3916083916083917]
[351,1435,119.58333333333333,0.69686411149825789,12,8.3623693379790947]
[352,1440,120,0.69444444444444442,12,8.3333333333333339]
[353,1445,120.41666666666667,0.69204152249134943,12,8.3044982698961931]
[354,1450,120.83333333333333,0.68965517241379315,12,8.2758620689655178]
[355,1455,121.25,0.6872852233676976,12,8.247422680412372]
[356,1460,121.66666666666667,0.68493150684931503,12,8.2191780821917799]
[357,1465,122.08333333333333,0.68259385665529015,12,8.1911262798634805]
[358,1470,122.5,0.68027210884353739,12,8.1632653061224492]
[359,1475,122.91666666666667,0.67796610169491522,12,8.1355932203389827]
[360,1480,123.33333333333333,0.67567567567567566,12,8.1081081081081088]
[361,1485,123.75,0.67340067340067344,12,8.0808080808080813]
[362,1490,124.16666666666667,0.67114093959731547,12,8.0536912751677843]
[363,1495,124.58333333333333,0.66889632107023411,12,8.0267558528428111]
[364,1500,125,0.66666666666666663,12,8]

{"sheet":"Data Type","index":4,"n_rows":36,"n_cols":9,"rows_kept":36,"cut":false,"hidden":true,"merged":[]}
[null,null,"Tx",null,null,null,"Rx"]
[null,"Data Type","Bits/pixel","(Odd lines)","Pixels/clock","(Odd lines)","Bits/pixel","Pixels/clock","Max HRES"]
[null,"RAW10",10,"",6,"",10,4,4608]
[null,"RAW12",12,"",5,"",12,4,3840]
[null,"RAW14",14,"",4,"",14,4,3288]
[null,"RAW6",6,"",10,"",6,8,7680]
[null,"RAW7",7,"",8,"",7,8,6576]
[null,"RAW8",8,"",8,"",8,8,5760]
[null,"RGB444",12,"",4,"",12,4,2880]
[null,"RGB555",15,"",4,"",15,4,2880]
[null,"RGB565",16,"",4,"",16,4,2880]
[null,"RGB666",18,"",3,"",18,3,2556]
[null,"RGB888",24,"",2,"",24,2,1920]
[null,"User Defined",8,"",8,"",8,8,5760]
[null,"YUV 420 10-bit",20,10,2,6,20,2,1920]
[null,"YUV 420 8-bit",16,8,4,8,16,4,1920]
[null,"YUV 420 8-bit (Legacy)",12,"",4,"",12,4,3840]
[null,"YUV 422 10-bit",20,"",2,"",20,2,2304]
[null,"YUV 422 8-bit",16,"",4,"",16,4,2880]
[]
[]
[]
[]
[]
[null,"Clock Mode"]
[null,"Continuous"]
[null,"Non-continuous"]
[]
[null,"Frame Mode"]
[null,"General"]
[null,"Accurate"]
[]
[null,"Number of Lanes"]
[null,1]
[null,2]
[null,4]

{"sheet":"W Dummy","index":5,"n_rows":49,"n_cols":15,"rows_kept":49,"cut":false,"hidden":true,"merged":[[14,2,14,14],[15,2,15,14],[16,2,16,14],[17,2,17,14],[1,7,1,12],[9,2,9,14],[10,2,10,14],[11,2,11,14],[12,2,12,14],[13,2,13,14]]}
[]
[null,null,null,null,null,null,null,"Blanking Calculation"]
[]
[]
[]
[]
[]
["Variable Parameters List","Values",null,null,null,null,"Editable"]
[]
["Byte clock in ns",{"$f":"(8/B15)","v":5.333333333333333},"DPHY TX Byte Clock duration in nanoseconds"]
["Phy Delay in ns",{"$f":"'DYNAMIC HRES GEN'!H1","v":1586},"Duration between TxRequestHS high and TxReadyHS high"]
["Phy Stop state Delay in ns",0,"Duration between TxRequestHS low and stopstate high"]
["No. of HS Packets",1,"Number of HS packets to be transmitted between hsync. \n4-> one LS packet, one LE packet, and one image long packet \nNote: Set 1 for GENERIC mode with. set 3 for ACCURATE mode"]
["No. of Short Pkt Bytes",{"$f":"(B13*4)/B17","v":1},"No of byte clocks required to send the short packets."]
[" PHY Speed in Gbps",{"$f":"('MIPI TX'!C12)/1000","v":1.5},"PHY speed in GBPS"]
["Camera datarate in Gbps",{"$f":"('MIPI TX'!C12)/1000","v":1.5},"Datarate at camera interafce in GBPS"]
["No. of Lane's",4,"Number of lanes"]
["Pixel count (Haddr)",{"$f":"'MIPI TX'!C4","v":1920},"No of pixel per line."]
[]
["Datatype","No. of Bits per clock","Number of Pixels","Pixel clock  in ns","No. of Bytes  ","No. of Bytes +2 (CRC)  ","No. of Bytes ","PPI line time in ns ","PPI line time in ns with overhead time","Total Line Pixel clock ","Total Blanking ","Total Blanking ","HBP in pixel clock","HFP in pixel clock","HSYNC in pixel clock"]
["Raw6",60,10,{"$f":"(B21/B$16)*(1/B$17)","v":10},{"$f":"(B18*3)/4","v":1440},{"$f":"E21+2","v":1442},{"$f":"ROUNDUP((F21/B$17),0)","v":361},{"$f":"(B$10*G21)+(B$10*B$14)+(B$11*B$13)+(B$12*B$13)","v":3516.6666666666665},{"$f":"(H21*130)/100","v":4571.6666666666661},{"$f":"ROUND((I21/D21),0)","v":457},{"$f":"J21-(B$18/10)","v":265},{"$f":"IF(K21<100,100,K21)","v":265},{"$f":"ROUNDUP((L21/10*6),0)","v":159},{"$f":"ROUNDUP(((L21/10*3)),0)","v":80},{"$f":"ROUNDUP(((L21/10)),0)","v":27}]
["Raw7",56,8,9.3333333333333339,{"$f":"(B18*7)/8","v":1680},1682,421,3836.6666666666665,{"$f":"(H22*130)/100","v":4987.6666666666661},{"$f":"ROUND((I22/D22),0)","v":534},{"$f":"J22-(B$18/8)","v":294},{"$f":"IF(K22<100,100,K22)","v":294},{"$f":"ROUNDUP((L22/10*6),0)","v":177},{"$f":"ROUNDUP(((L22/10*3)),0)","v":89},{"$f":"ROUNDUP(((L22/10)),0)","v":30}]
["Raw8",64,8,{"$f":"(B23/B$16)*(1/B$17)","v":10.666666666666666},{"$f":"B18","v":1920},{"$f":"E23+2","v":1922},{"$f":"ROUNDUP((F23/B$17),0)","v":481},{"$f":"(B$10*G23)+(B$10*B$14)+(B$11*B$13)+(B$12*B$13)","v":4156.6666666666661},{"$f":"(H23*132)/100","v":5486.7999999999993},514,{"$f":"J23-(B$18/8)","v":274},274,165,83,28]
["Raw10",60,6,{"$f":"(B24/B16)*(1/B17)","v":10},{"$f":"B18/4 *5","v":2400},{"$f":"E24+2","v":2402},{"$f":"ROUNDUP((F24/B17),0)","v":601},{"$f":"(B$10*G24)+(B$10*B$14)+(B$11*B$13)+(B$12*B$13)","v":4796.6666666666661},6235.6666666666661,624,{"$f":"J24-(B18/6)","v":304},304,183,92,31]
["Raw12",60,5,{"$f":"(B25/B16)*(1/B17)","v":10},{"$f":"B18/2 *3","v":2880},2882,{"$f":"ROUNDUP((F25/B17),0)","v":721},{"$f":"(B10*G25)+(B10*B14)+(B11*B13)+(B12*B13)","v":5436.6666666666661},7067.6666666666661,707,{"$f":"J25-(B18/5)","v":323},323,194,97,33]
["Raw14",56,4,{"$f":"(B26/B16)*(1/B17)","v":9.3333333333333339},{"$f":"B18/4 *7","v":3360},3362,{"$f":"ROUNDUP((F26/B17),0)","v":841},{"$f":"(B10*G26)+(B10*B14)+(B11*B13)+(B12*B13)","v":6076.6666666666661},7899.6666666666661,846,{"$f":"J26-(B18/4)","v":366},366,220,110,37]
["User Defined",64,8,{"$f":"(B27/B16)*(1/B17)","v":10.666666666666666},{"$f":"B$18","v":1920},1922,{"$f":"ROUNDUP((F27/B17),0)","v":481},{"$f":"(B10*G27)+(B10*B14)+(B11*B13)+(B12*B13)","v":4156.6666666666661},5403.6666666666661,507,{"$f":"J27-(B$18/8)","v":267},267,161,81,27]
["User_Def 2 - 10-7-10",64,8,{"$f":"(B28/B16)*(1/B17)","v":10.666666666666666},{"$f":"B$18","v":1920},1922,{"$f":"ROUNDUP((F28/B17),0)","v":481},{"$f":"(B10*G28)+(B10*B14)+(B11*B13)+(B12*B13)","v":4156.6666666666661},5403.6666666666661,507,{"$f":"J28-(B$18/8)","v":267},267,161,81,27]
["User_Def 3 - 10-8-10",64,8,{"$f":"(B29/B16)*(1/B17)","v":10.666666666666666},1920,1922,{"$f":"ROUNDUP((F29/B17),0)","v":481},{"$f":"(B10*G29)+(B10*B14)+(B11*B13)+(B12*B13)","v":4156.6666666666661},5403.6666666666661,507,267,267,161,81,27]
["User_Def 4 - 12-6-12",64,8,{"$f":"(B30/B16)*(1/B17)","v":10.666666666666666},1920,1922,{"$f":"ROUNDUP((F30/B17),0)","v":481},{"$f":"(B10*G30)+(B10*B14)+(B11*B13)+(B12*B13)","v":4156.6666666666661},5403.6666666666661,507,267,267,161,81,27]
["User_Def 5 - 12-7-12",64,8,{"$f":"(B31/B16)*(1/B17)","v":10.666666666666666},1920,1922,{"$f":"ROUNDUP((F31/B17),0)","v":481},{"$f":"(B10*G31)+(B10*B14)+(B11*B13)+(B12*B13)","v":4156.6666666666661},5403.6666666666661,507,267,267,161,81,27]
["User_Def 6 - 12-8-12",64,8,{"$f":"(B32/B16)*(1/B17)","v":10.666666666666666},1920,1922,{"$f":"ROUNDUP((F32/B17),0)","v":481},{"$f":"(B10*G32)+(B10*B14)+(B11*B13)+(B12*B13)","v":4156.6666666666661},5403.6666666666661,507,267,267,161,81,27]
["User_Def 7 - 12-10-12",64,8,{"$f":"(B33/B16)*(1/B17)","v":10.666666666666666},1920,1922,{"$f":"ROUNDUP((F33/B17),0)","v":481},{"$f":"(B10*G33)+(B10*B14)+(B11*B13)+(B12*B13)","v":4156.6666666666661},5403.6666666666661,507,267,267,161,81,27]
["User_Def 8",64,8,{"$f":"(B34/B$16)*(1/B$17)","v":10.666666666666666},1920,1922,{"$f":"ROUNDUP((F34/B$17),0)","v":481},{"$f":"(B$10*G34)+(B$10*B$14)+(B$11*B$13)+(B$12*B$13)","v":4156.6666666666661},5403.6666666666661,507,{"$f":"J34-(B$18/C34)","v":267},267,161,81,27]
["RGB444",48,4,{"$f":"(B35/B$16)*(1/B$17)","v":8},{"$f":"B$18*2","v":3840},3842,{"$f":"ROUNDUP((F35/B$17),0)","v":961},{"$f":"(B$10*G35)+(B$10*B$14)+(B$11*B$13)+(B$12*B$13)","v":6716.6666666666661},8731.6666666666661,1091,{"$f":"J35-(B$18/C35)","v":611},611,367,184,62]
["RGB555",60,4,10,3840,3842,961,6716.6666666666661,8731.6666666666661,873,393,393,236,118,40]
["RGB565",64,4,10.666666666666666,3840,3842,961,6716.6666666666661,8731.6666666666661,819,339,339,204,102,34]
["RGB666",54,3,9,{"$f":"(B$18*9)/4","v":4320},4322,1081,7356.6666666666661,9563.6666666666661,1063,423,423,254,127,43]
["YUV 420 8-bit (Legacy)",48,4,8,{"$f":"(B18/2)*3","v":2880},2882,721,5436.6666666666661,7067.6666666666661,883,403,403,242,121,41]
["YUV 422 8-bit",64,4,10.666666666666666,{"$f":"B$18*2","v":3840},3842,961,6716.6666666666661,8731.6666666666661,819,339,339,204,102,34]
["YUV 422 10-bit",40,2,{"$f":"(B41/B$16)*(1/B$17)","v":6.666666666666667},{"$f":"B$18*10/4","v":4800},{"$f":"E41+2","v":4802},{"$f":"ROUNDUP((F41/B$17),0)","v":1201},{"$f":"(B$10*G41)+(B$10*B$14)+(B$11*B$13)+(B$12*B$13)","v":7996.6666666666661},{"$f":"(H41*140)/100","v":11195.333333333332},{"$f":"ROUND((I41/D41),0)","v":1679},{"$f":"J41-(B$18/C41)","v":719},{"$f":"IF(K41<100,100,K41)","v":719},432,216,72]
["RGB888",48,2,{"$f":"(B42/B$16)*(1/B$17)","v":8},{"$f":"B$18*3","v":5760},{"$f":"E42+2","v":5762},{"$f":"ROUNDUP((F42/B$17),0)","v":1441},{"$f":"(B$10*G42)+(B$10*B$14)+(B$11*B$13)+(B$12*B$13)","v":9276.6666666666661},{"$f":"(H42*140)/100","v":12987.333333333332},{"$f":"ROUND((I42/D42),0)","v":1623},{"$f":"J42-(B$18/C42)","v":663},{"$f":"IF(K42<100,100,K42)","v":663},398,199,67]
["YUV 420 8-bit",64,4,{"$f":"(B43/B$16)*(1/B$17)","v":10.666666666666666},{"$f":"B$18*2","v":3840},{"$f":"E43+2","v":3842},{"$f":"ROUNDUP((F43/B$17),0)","v":961},{"$f":"(B$10*G43)+(B$10*B$14)+(B$11*B$13)+(B$12*B$13)","v":6716.6666666666661},{"$f":"(H43*160)/100","v":10746.666666666664},{"$f":"ROUND((I43/D43),0)","v":1008},{"$f":"J43-(B$18/C43)","v":528},{"$f":"IF(K43<100,100,K43)","v":528},317,159,53]
["YUV 420 10-bit",40,2,6.666666666666667,{"$f":"B$18/4*10","v":4800},4802,1201,7996.6666666666661,{"$f":"(H44*160)/100","v":12794.666666666664},1919,959,959,576,288,96]
[]
[]
[]
["Datatype","No. of Bits per clock","Number of Pixels","Pixel clock  in ns","No. of Bytes  ","No. of Bytes +2 (CRC)  ","No. of Bytes ","PPI line time in ns ","PPI line time in ns with overhead time","Total Line Pixel clock ","Total Blanking ","Total Blanking ","HBP in pixel clock","HFP in pixel clock","HSYNC in pixel clock"]
[{"$f":"'MIPI TX'!C3","v":"RAW10"},{"$f":"VLOOKUP($A$49,$A$21:$O$44,2,FALSE)","v":60},{"$f":"VLOOKUP($A$49,$A$21:$O$44,3,FALSE)","v":6},{"$f":"1/'MIPI TX'!C9*1000","v":10},{"$f":"VLOOKUP($A$49,$A$21:$O$44,5,FALSE)","v":2400},{"$f":"VLOOKUP($A$49,$A$21:$O$44,6,FALSE)","v":2402},{"$f":"VLOOKUP($A$49,$A$21:$O$44,7,FALSE)","v":601},{"$f":"VLOOKUP($A$49,$A$21:$O$44,8,FALSE)","v":4796.6666666666661},{"$f":"VLOOKUP($A$49,$A$21:$O$44,9,FALSE)","v":6235.6666666666661},{"$f":"ROUND((I49/D49),0)","v":624},{"$f":"J49-(B$18/8)","v":384},{"$f":"IF(K49<100,100,K49)","v":384},{"$f":"ROUNDUP((L49/10*6),0)","v":231},{"$f":"ROUNDUP(((L49/10*3)),0)","v":116},{"$f":"ROUNDUP(((L49/10)),0)","v":39}]

{"sheet":"Revision History","index":6,"n_rows":6,"n_cols":3,"rows_kept":6,"cut":false,"hidden":false,"merged":[]}
["Date","Version","Description"]
["2020-05-21","1.0","Initial release."]
["2020-06-09",1.1000000000000001,"Added MIPI RX"]
["2020-12-10",1.2,"Added reference waveform for dynamic HRES"]
["2021-12-08",1.3,"Data Type formula for RAW10 correction."]
["2023-07-03",1.4,"Fixed Dynamic Hres Gen tools forever loop."]